{"text_format":"1","workbook":"xlsx","n_sheets":13,"sheets":["Accueil","Registre_IST","Modification","Nouveau","Modif2","Valid","Rap_Mens","Rap_Sem","Rap_Trim","Méd_cons","Gestion_Stock","Etat_stock","Commande_CIDAG"],"not_rendered":{"charts":0,"images":2,"macros":1,"external_links":0,"defined_names":65,"comments":3,"pivot_tables":0},"unopened":[],"bounds":{"document_bytes":16777216,"sheet_cells":100000,"rows_first":2000,"rows_last":500,"rows_between":2000,"halvings":0,"cell_chars":16384,"cell_head_chars":4096},"cells_cut":0,"cells_raw":0,"read":"whole","date_system":"1900"}

{"sheet":"Accueil","index":0,"n_rows":14,"n_cols":13,"rows_kept":14,"cut":false,"hidden":false,"merged":[[2,8,2,13],[8,3,8,4],[9,3,9,4],[13,5,13,7],[13,8,13,10],[13,11,13,13],[10,3,10,4],[3,8,3,10],[3,12,3,13],[4,8,4,10],[4,12,4,13],[5,8,5,10],[5,12,5,13],[6,8,6,10],[6,12,6,13],[7,8,7,10],[7,12,7,13],[8,8,8,10],[8,12,8,13],[9,8,9,10],[9,12,9,13]]}
[null,"Association de Lutte Contre le Sida"]
[null,"Consultation IST"]
[null,null,null,null,null,null,null,null,"Alertes stock"]
[null,null,null,null,null,null,null,null,{"$f":"IF(Etat_stock!F10>0,\"Extencilline proche peremption :\",\"\")","v":""},null,null,{"$f":"IF(Etat_stock!F10>0,Etat_stock!F10,\"\")","v":""},{"$f":"IF(Etat_stock!H10=\"Stock insuffisant\",\"Stock Extencilline insuffisant\",\"\")","v":"Stock Extencilline insuffisant"}]
[null,null,null,null,null,null,null,null,{"$f":"IF(Etat_stock!F11>0,\"Péni A proche peremption :\",\"\")","v":""},null,null,{"$f":"IF(Etat_stock!F11>0,Etat_stock!F11,\"\")","v":""},{"$f":"IF(Etat_stock!H11=\"Stock insuffisant\",\"Stock Ceftriaxone insuffisant\",\"\")","v":"Stock Ceftriaxone insuffisant"}]
[null,null,null,null,null,null,null,null,{"$f":"IF(Etat_stock!F12>0,\"Erythromycine proche peremption :\",\"\")","v":""},null,null,{"$f":"IF(Etat_stock!F12>0,Etat_stock!F12,\"\")","v":""},{"$f":"IF(Etat_stock!H12=\"Stock insuffisant\",\"Stock Erythromycine insuffisant\",\"\")","v":"Stock Erythromycine insuffisant"}]
[null,null,null,null,null,null,null,null,{"$f":"IF(Etat_stock!F13>0,\"Doxicycline proche peremption :\",\"\")","v":""},null,null,{"$f":"IF(Etat_stock!F13>0,Etat_stock!F13,\"\")","v":""},{"$f":"IF(Etat_stock!H13=\"Stock insuffisant\",\"Stock Doxicycline insuffisant\",\"\")","v":"Stock Doxicycline insuffisant"}]
[null,null,null,null,null,null,null,null,{"$f":"IF(Etat_stock!F14>0,\"Econazol proche peremption :\",\"\")","v":""},null,null,{"$f":"IF(Etat_stock!F14>0,Etat_stock!F14,\"\")","v":""},{"$f":"IF(Etat_stock!H14=\"Stock insuffisant\",\"Stock Econazole insuffisant\",\"\")","v":"Stock Econazole insuffisant"}]
[null,"Section",null,null,null,null,null,null,{"$f":"IF(Etat_stock!F15>0,\"Métronidazol proche peremption :\",\"\")","v":""},null,null,{"$f":"IF(Etat_stock!F15>0,Etat_stock!F15,\"\")","v":""},{"$f":"IF(Etat_stock!H15=\"Stock insuffisant\",\"Stock Métronidazol insuffisant\",\"\")","v":"Stock Métronidazol insuffisant"}]
[null,"Année",null,null,null,null,null,null,{"$f":"IF(Etat_stock!F16>0,\"Ciprofloxacine proche peremption :\",\"\")","v":""},null,null,{"$f":"IF(Etat_stock!F16>0,Etat_stock!F16,\"\")","v":""},{"$f":"IF(Etat_stock!H16=\"Stock insuffisant\",\"Stock Ciprofloxacine insuffisant\",\"\")","v":"Stock Ciprofloxacine insuffisant"}]
[null,"CIDAG"]
[]
[]
[null,null,null,null,null,"Gestion des consultants",null,null,"Rapports",null,null,"Gestion des médicaments"]

{"sheet":"Registre_IST","index":1,"n_rows":10088,"n_cols":27,"rows_kept":10088,"cut":false,"hidden":true,"merged":[]}
["Date","Date2","Mois","Num ordre","Num consultant","Age","Gr.  Age","Gr.  Age1","Sexe","Sexe1","Sit. Matr","Bénéficiaires","Bénéficiaires1","Cas","Synd. IST","Synd. IST1 ","Prise ATB","Bilans prescrits","Résultats","Traitements","Quantité ","Observations","Section","Stratégie","Site","Trimestre","Semestre"]
[]
[]
[]
[]
[]
[]
[]
[]
[]
[]
[]
[]
[]
[]
[]
[]
[]
[]
[]
[]
[]
[]
[]
[]
[]
[]
[]
[]
[]
[]
[]
[]
[]
[]
[]
[]
[]
[]
[]
[]
[]
[]
[]
[]
[]
[]
[]
[]
[]
[]
[]
[]
[]
[]
[]
[]
[]
[]
[]
[]
[]
[]
[]
[]
[]
[]
[]
[]
[]
[]
[]
[]
[]
[]
[]
[]
[]
[]
[]
[]
[]
[]
[]
[]
[]
[]
[]
[]
[]
[]
[]
[]
[]
[]
[]
[]
[]
[]
[]
[]
[]
[]
[]
[]
[]
[]
[]
[]
[]
[]
[]
[]
[]
[]
[]
[]
[]
[]
[]
[]
[]
[]
[]
[]
[]
[]
[]
[]
[]
[]
[]
[]
[]
[]
[]
[]
[]
[]
[]
[]
[]
[]
[]
[]
[]
[]
[]
[]
[]
[]
[]
[]
[]
[]
[]
[]
[]
[]
[]
[]
[]
[]
[]
[]
[]
[]
[]
[]
[]
[]
[]
[]
[]
[]
[]
[]
[]
[]
[]
[]
[]
[]
[]
[]
[]
[]
[]
[]
[]
[]
[]
[]
[]
[]
[]
[]
[]
[]
[]
[]
[]
[]
[]
[]
[]
[]
[]
[]
[]
[]
[]
[]
[]
[]
[]
[]
[]
[]
[]
[]
[]
[]
[]
[]
[]
[]
[]
[]
[]
[]
[]
[]
[]
[]
[]
[]
[]
[]
[]
[]
[]
[]
[]
[]
[]
[]
[]
[]
[]
[]
[]
[]
[]
[]
[]
[]
[]
[]
[]
[]
[]
[]
[]
[]
[]
[]
[]
[]
[]
[]
[]
[]
[]
[]
[]
[]
[]
[]
[]
[]
[]
[]
[]
[]
[]
[]
[]
[]
[]
[]
[]
[]
[]
[]
[]
[]
[]
[]
[]
[]
[]
[]
[]
[]
[]
[]
[]
[]
[]
[]
[]
[]
[]
[]
[]
[]
[]
[]
[]
[]
[]
[]
[]
[]
[]
[]
[]
[]
[]
[]
[]
[]
[]
[]
[]
[]
[]
[]
[]
[]
[]
[]
[]
[]
[]
[]
[]
[]
[]
[]
[]
[]
[]
[]
[]
[]
[]
[]
[]
[]
[]
[]
[]
[]
[]
[]
[]
[]
[]
[]
[]
[]
[]
[]
[]
[]
[]
[]
[]
[]
[]
[]
[]
[]
[]
[]
[]
[]
[]
[]
[]
[]
[]
[]
[]
[]
[]
[]
[]
[]
[]
[]
[]
[]
[]
[]
[]
[]
[]
[]
[]
[]
[]
[]
[]
[]
[]
[]
[]
[]
[]
[]
[]
[]
[]
[]
[]
[]
[]
[]
[]
[]
[]
[]
[]
[]
[]
[]
[]
[]
[]
[]
[]
[]
[]
[]
[]
[]
[]
[]
[]
[]
[]
[]
[]
[]
[]
[]
[]
[]
[]
[]
[]
[]
[]
[]
[]
[]
[]
[]
[]
[]
[]
[]
[]
[]
[]
[]
[]
[]
[]
[]
[]
[]
[]
[]
[]
[]
[]
[]
[]
[]
[]
[]
[]
[]
[]
[]
[]
[]
[]
[]
[]
[]
[]
[]
[]
[]
[]
[]
[]
[]
[]
[]
[]
[]
[]
[]
[]
[]
[]
[]
[]
[]
[]
[]
[]
[]
[]
[]
[]
[]
[]
[]
[]
[]
[]
[]
[]
[]
[]
[]
[]
[]
[]
[]
[]
[]
[]
[]
[]
[]
[]
[]
[]
[]
[]
[]
[]
[]
[]
[]
[]
[]
[]
[]
[]
[]
[]
[]
[]
[]
[]
[]
[]
[]
[]
[]
[]
[]
[]
[]
[]
[]
[]
[]
[]
[]
[]
[]
[]
[]
[]
[]
[]
[]
[]
[]
[]
[]
[]
[]
[]
[]
[]
[]
[]
[]
[]
[]
[]
[]
[]
[]
[]
[]
[]
[]
[]
[]
[]
[]
[]
[]
[]
[]
[]
[]
[]
[]
[]
[]
[]
[]
[]
[]
[]
[]
[]
[]
[]
[]
[]
[]
[]
[]
[]
[]
[]
[]
[]
[]
[]
[]
[]
[]
[]
[]
[]
[]
[]
[]
[]
[]
[]
[]
[]
[]
[]
[]
[]
[]
[]
[]
[]
[]
[]
[]
[]
[]
[]
[]
[]
[]
[]
[]
[]
[]
[]
[]
[]
[]
[]
[]
[]
[]
[]
[]
[]
[]
[]
[]
[]
[]
[]
[]
[]
[]
[]
[]
[]
[]
[]
[]
[]
[]
[]
[]
[]
[]
[]
[]
[]
[]
[]
[]
[]
[]
[]
[]
[]
[]
[]
[]
[]
[]
[]
[]
[]
[]
[]
[]
[]
[]
[]
[]
[]
[]
[]
[]
[]
[]
[]
[]
[]
[]
[]
[]
[]
[]
[]
[]
[]
[]
[]
[]
[]
[]
[]
[]
[]
[]
[]
[]
[]
[]
[]
[]
[]
[]
[]
[]
[]
[]
[]
[]
[]
[]
[]
[]
[]
[]
[]
[]
[]
[]
[]
[]
[]
[]
[]
[]
[]
[]
[]
[]
[]
[]
[]
[]
[]
[]
[]
[]
[]
[]
[]
[]
[]
[]
[]
[]
[]
[]
[]
[]
[]
[]
[]
[]
[]
[]
[]
[]
[]
[]
[]
[]
[]
[]
[]
[]
[]
[]
[]
[]
[]
[]
[]
[]
[]
[]
[]
[]
[]
[]
[]
[]
[]
[]
[]
[]
[]
[]
[]
[]
[]
[]
[]
[]
[]
[]
[]
[]
[]
[]
[]
[]
[]
[]
[]
[]
[]
[]
[]
[]
[]
[]
[]
[]
[]
[]
[]
[]
[]
[]
[]
[]
[]
[]
[]
[]
[]
[]
[]
[]
[]
[]
[]
[]
[]
[]
[]
[]
[]
[]
[]
[]
[]
[]
[]
[]
[]
[]
[]
[]
[]
[]
[]
[]
[]
[]
[]
[]
[]
[]
[]
[]
[]
[]
[]
[]
[]
[]
[]
[]
[]
[]
[]
[]
[]
[]
[]
[]
[]
[]
[]
[]
[]
[]
[]
[]
[]
[]
[]
[]
[]
[]
[]
[]
[]
[]
[]
[]
[]
[]
[]
[]
[]
[]
[]
[]
[]
[]
[]
[]
[]
[]
[]
[]
[]
[]
[]
[]
[]
[]
[]
[]
[]
[]
[]
[]
[]
[]
[]
[]
[]
[]
[]
[]
[]
[]
[]
[]
[]
[]
[]
[]
[]
[]
[]
[]
[]
[]
[]
[]
[]
[]
[]
[]
[]
[]
[]
[]
[]
[]
[]
[]
[]
[]
[]
[]
[]
[]
[]
[]
[]
[]
[]
[]
[]
[]
[]
[]
[]
[]
[]
[]
[]
[]
[]
[]
[]
[]
[]
[]
[]
[]
[]
[]
[]
[]
[]
[]
[]
[]
[]
[]
[]
[]
[]
[]
[]
[]
[]
[]
[]
[]
[]
[]
[]
[]
[]
[]
[]
[]
[]
[]
[]
[]
[]
[]
[]
[]
[]
[]
[]
[]
[]
[]
[]
[]
[]
[]
[]
[]
[]
[]
[]
[]
[]
[]
[]
[]
[]
[]
[]
[]
[]
[]
[]
[]
[]
[]
[]
[]
[]
[]
[]
[]
[]
[]
[]
[]
[]
[]
[]
[]
[]
[]
[]
[]
[]
[]
[]
[]
[]
[]
[]
[]
[]
[]
[]
[]
[]
[]
[]
[]
[]
[]
[]
[]
[]
[]
[]
[]
[]
[]
[]
[]
[]
[]
[]
[]
[]
[]
[]
[]
[]
[]
[]
[]
[]
[]
[]
[]
[]
[]
[]
[]
[]
[]
[]
[]
[]
[]
[]
[]
[]
[]
[]
[]
[]
[]
[]
[]
[]
[]
[]
[]
[]
[]
[]
[]
[]
[]
[]
[]
[]
[]
[]
[]
[]
[]
[]
[]
[]
[]
[]
[]
[]
[]
[]
[]
[]
[]
[]
[]
[]
[]
[]
[]
[]
[]
[]
[]
[]
[]
[]
[]
[]
[]
[]
[]
[]
[]
[]
[]
[]
[]
[]
[]
[]
[]
[]
[]
[]
[]
[]
[]
[]
[]
[]
[]
[]
[]
[]
[]
[]
[]
[]
[]
[]
[]
[]
[]
[]
[]
[]
[]
[]
[]
[]
[]
[]
[]
[]
[]
[]
[]
[]
[]
[]
[]
[]
[]
[]
[]
[]
[]
[]
[]
[]
[]
[]
[]
[]
[]
[]
[]
[]
[]
[]
[]
[]
[]
[]
[]
[]
[]
[]
[]
[]
[]
[]
[]
[]
[]
[]
[]
[]
[]
[]
[]
[]
[]
[]
[]
[]
[]
[]
[]
[]
[]
[]
[]
[]
[]
[]
[]
[]
[]
[]
[]
[]
[]
[]
[]
[]
[]
[]
[]
[]
[]
[]
[]
[]
[]
[]
[]
[]
[]
[]
[]
[]
[]
[]
[]
[]
[]
[]
[]
[]
[]
[]
[]
[]
[]
[]
[]
[]
[]
[]
[]
[]
[]
[]
[]
[]
[]
[]
[]
[]
[]
[]
[]
[]
[]
[]
[]
[]
[]
[]
[]
[]
[]
[]
[]
[]
[]
[]
[]
[]
[]
[]
[]
[]
[]
[]
[]
[]
[]
[]
[]
[]
[]
[]
[]
[]
[]
[]
[]
[]
[]
[]
[]
[]
[]
[]
[]
[]
[]
[]
[]
[]
[]
[]
[]
[]
[]
[]
[]
[]
[]
[]
[]
[]
[]
[]
[]
[]
[]
[]
[]
[]
[]
[]
[]
[]
[]
[]
[]
[]
[]
[]
[]
[]
[]
[]
[]
[]
[]
[]
[]
[]
[]
[]
[]
[]
[]
[]
[]
[]
[]
[]
[]
[]
[]
[]
[]
[]
[]
[]
[]
[]
[]
[]
[]
[]
[]
[]
[]
[]
[]
[]
[]
[]
[]
[]
[]
[]
[]
[]
[]
[]
[]
[]
[]
[]
[]
[]
[]
[]
[]
[]
[]
[]
[]
[]
[]
[]
[]
[]
[]
[]
[]
[]
[]
[]
[]
[]
[]
[]
[]
[]
[]
[]
[]
[]
[]
[]
[]
[]
[]
[]
[]
[]
[]
[]
[]
[]
[]
[]
[]
[]
[]
[]
[]
[]
[]
[]
[]
[]
[]
[]
[]
[]
[]
[]
[]
[]
[]
[]
[]
[]
[]
[]
[]
[]
[]
[]
[]
[]
[]
[]
[]
[]
[]
[]
[]
[]
[]
[]
[]
[]
[]
[]
[]
[]
[]
[]
[]
[]
[]
[]
[]
[]
[]
[]
[]
[]
[]
[]
[]
[]
[]
[]
[]
[]
[]
[]
[]
[]
[]
[]
[]
[]
[]
[]
[]
[]
[]
[]
[]
[]
[]
[]
[]
[]
[]
[]
[]
[]
[]
[]
[]
[]
[]
[]
[]
[]
[]
[]
[]
[]
[]
[]
[]
[]
[]
[]
[]
[]
[]
[]
[]
[]
[]
[]
[]
[]
[]
[]
[]
[]
[]
[]
[]
[]
[]
[]
[]
[]
[]
[]
[]
[]
[]
[]
[]
[]
[]
[]
[]
[]
[]
[]
[]
[]
[]
[]
[]
[]
[]
[]
[]
[]
[]
[]
[]
[]
[]
[]
[]
[]
[]
[]
[]
[]
[]
[]
[]
[]
[]
[]
[]
[]
[]
[]
[]
[]
[]
[]
[]
[]
[]
[]
[]
[]
[]
[]
[]
[]
[]
[]
[]
[]
[]
[]
[]
[]
[]
[]
[]
[]
[]
[]
[]
[]
[]
[]
[]
[]
[]
[]
[]
[]
[]
[]
[]
[]
[]
[]
[]
[]
[]
[]
[]
[]
[]
[]
[]
[]
[]
[]
[]
[]
[]
[]
[]
[]
[]
[]
[]
[]
[]
[]
[]
[]
[]
[]
[]
[]
[]
[]
[]
[]
[]
[]
[]
[]
[]
[]
[]
[]
[]
[]
[]
[]
[]
[]
[]
[]
[]
[]
[]
[]
[]
[]
[]
[]
[]
[]
[]
[]
[]
[]
[]
[]
[]
[]
[]
[]
[]
[]
[]
[]
[]
[]
[]
[]
[]
[]
[]
[]
[]
[]
[]
[]
[]
[]
[]
[]
[]
[]
[]
[]
[]
[]
[]
[]
[]
[]
[]
[]
[]
[]
[]
[]
[]
[]
[]
[]
[]
[]
[]
[]
[]
[]
[]
[]
[]
[]
[]
[]
[]
[]
[]
[]
[]
[]
[]
[]
[]
[]
[]
[]
[]
[]
[]
[]
[]
[]
[]
[]
[]
[]
[]
[]
[]
[]
[]
[]
[]
[]
[]
[]
[]
[]
[]
[]
[]
[]
[]
[]
[]
[]
[]
[]
[]
[]
[]
[]
[]
[]
[]
[]
[]
[]
[]
[]
[]
[]
[]
[]
[]
[]
[]
[]
[]
[]
[]
[]
[]
[]
[]
[]
[]
[]
[]
[]
[]
[]
[]
[]
[]
[]
[]
[]
[]
[]
[]
[]
[]
[]
[]
[]
[]
[]
[]
[]
[]
[]
[]
[]
[]
[]
[]
[]
[]
[]
[]
[]
[]
[]
[]
[]
[]
[]
[]
[]
[]
[]
[]
[]
[]
[]
[]
[]
[]
[]
[]
[]
[]
[]
[]
[]
[]
[]
[]
[]
[]
[]
[]
[]
[]
[]
[]
[]
[]
[]
[]
[]
[]
[]
[]
[]
[]
[]
[]
[]
[]
[]
[]
[]
[]
[]
[]
[]
[]
[]
[]
[]
[]
[]
[]
[]
[]
[]
[]
[]
[]
[]
[]
[]
[]
[]
[]
[]
[]
[]
[]
[]
[]
[]
[]
[]
[]
[]
[]
[]
[]
[]
[]
[]
[]
[]
[]
[]
[]
[]
[]
[]
[]
[]
[]
[]
[]
[]
[]
[]
[]
[]
[]
[]
[]
[]
[]
[]
[]
[]
[]
[]
[]
[]
[]
[]
[]
[]
[]
[]
[]
[]
[]
[]
[]
[]
[]
[]
[]
[]
[]
[]
[]
[]
[]
[]
[]
[]
[]
[]
[]
[]
[]
[]
[]
[]
[]
[]
[]
[]
[]
[]
[]
[]
[]
[]
[]
[]
[]
[]
[]
[]
[]
[]
[]
[]
[]
[]
[]
[]
[]
[]
[]
[]
[]
[]
[]
[]
[]
[]
[]
[]
[]
[]
[]
[]
[]
[]
[]
[]
[]
[]
[]
[]
[]
[]
[]
[]
[]
[]
[]
[]
[]
[]
[]
[]
[]
[]
[]
[]
[]
[]
[]
[]
[]
[]
[]
[]
[]
[]
[]
[]
[]
[]
[]
[]
[]
[]
[]
[]
[]
[]
[]
[]
[]
[]
[]
[]
[]
[]
[]
[]
[]
[]
[]
[]
[]
[]
[]
[]
[]
[]
[]
[]
[]
[]
[]
[]
[]
[]
[]
[]
[]
[]
[]
[]
[]
[]
[]
[]
[]
[]
[]
[]
[]
[]
[]
[]
[]
[]
[]
[]
[]
[]
[]
[]
[]
[]
[]
[]
[]
[]
[]
[]
[]
[]
[]
[]
[]
[]
[]
[]
[]
[]
[]
[]
[]
[]
[]
[]
[]
[]
[]
[]
[]
[]
[]
[]
[]
[]
[]
[]
[]
[]
[]
[]
[]
[]
[]
[]
[]
[]
[]
[]
[]
[]
[]
[]
[]
[]
[]
[]
[]
[]
[]
[]
[]
[]
[]
[]
[]
[]
[]
[]
[]
[]
[]
[]
[]
[]
[]
[]
[]
[]
[]
[]
[]
[]
[]
[]
[]
[]
[]
[]
[]
[]
[]
[]
[]
[]
[]
[]
[]
[]
[]
[]
[]
[]
[]
[]
[]
[]
[]
[]
[]
[]
[]
[]
[]
[]
[]
[]
[]
[]
[]
[]
[]
[]
[]
[]
[]
[]
[]
[]
[]
[]
[]
[]
[]
[]
[]
[]
[]
[]
[]
[]
[]
[]
[]
[]
[]
[]
[]
[]
[]
[]
[]
[]
[]
[]
[]
[]
[]
[]
[]
[]
[]
[]
[]
[]
[]
[]
[]
[]
[]
[]
[]
[]
[]
[]
[]
[]
[]
[]
[]
[]
[]
[]
[]
[]
[]
[]
[]
[]
[]
[]
[]
[]
[]
[]
[]
[]
[]
[]
[]
[]
[]
[]
[]
[]
[]
[]
[]
[]
[]
[]
[]
[]
[]
[]
[]
[]
[]
[]
[]
[]
[]
[]
[]
[]
[]
[]
[]
[]
[]
[]
[]
[]
[]
[]
[]
[]
[]
[]
[]
[]
[]
[]
[]
[]
[]
[]
[]
[]
[]
[]
[]
[]
[]
[]
[]
[]
[]
[]
[]
[]
[]
[]
[]
[]
[]
[]
[]
[]
[]
[]
[]
[]
[]
[]
[]
[]
[]
[]
[]
[]
[]
[]
[]
[]
[]
[]
[]
[]
[]
[]
[]
[]
[]
[]
[]
[]
[]
[]
[]
[]
[]
[]
[]
[]
[]
[]
[]
[]
[]
[]
[]
[]
[]
[]
[]
[]
[]
[]
[]
[]
[]
[]
[]
[]
[]
[]
[]
[]
[]
[]
[]
[]
[]
[]
[]
[]
[]
[]
[]
[]
[]
[]
[]
[]
[]
[]
[]
[]
[]
[]
[]
[]
[]
[]
[]
[]
[]
[]
[]
[]
[]
[]
[]
[]
[]
[]
[]
[]
[]
[]
[]
[]
[]
[]
[]
[]
[]
[]
[]
[]
[]
[]
[]
[]
[]
[]
[]
[]
[]
[]
[]
[]
[]
[]
[]
[]
[]
[]
[]
[]
[]
[]
[]
[]
[]
[]
[]
[]
[]
[]
[]
[]
[]
[]
[]
[]
[]
[]
[]
[]
[]
[]
[]
[]
[]
[]
[]
[]
[]
[]
[]
[]
[]
[]
[]
[]
[]
[]
[]
[]
[]
[]
[]
[]
[]
[]
[]
[]
[]
[]
[]
[]
[]
[]
[]
[]
[]
[]
[]
[]
[]
[]
[]
[]
[]
[]
[]
[]
[]
[]
[]
[]
[]
[]
[]
[]
[]
[]
[]
[]
[]
[]
[]
[]
[]
[]
[]
[]
[]
[]
[]
[]
[]
[]
[]
[]
[]
[]
[]
[]
[]
[]
[]
[]
[]
[]
[]
[]
[]
[]
[]
[]
[]
[]
[]
[]
[]
[]
[]
[]
[]
[]
[]
[]
[]
[]
[]
[]
[]
[]
[]
[]
[]
[]
[]
[]
[]
[]
[]
[]
[]
[]
[]
[]
[]
[]
[]
[]
[]
[]
[]
[]
[]
[]
[]
[]
[]
[]
[]
[]
[]
[]
[]
[]
[]
[]
[]
[]
[]
[]
[]
[]
[]
[]
[]
[]
[]
[]
[]
[]
[]
[]
[]
[]
[]
[]
[]
[]
[]
[]
[]
[]
[]
[]
[]
[]
[]
[]
[]
[]
[]
[]
[]
[]
[]
[]
[]
[]
[]
[]
[]
[]
[]
[]
[]
[]
[]
[]
[]
[]
[]
[]
[]
[]
[]
[]
[]
[]
[]
[]
[]
[]
[]
[]
[]
[]
[]
[]
[]
[]
[]
[]
[]
[]
[]
[]
[]
[]
[]
[]
[]
[]
[]
[]
[]
[]
[]
[]
[]
[]
[]
[]
[]
[]
[]
[]
[]
[]
[]
[]
[]
[]
[]
[]
[]
[]
[]
[]
[]
[]
[]
[]
[]
[]
[]
[]
[]
[]
[]
[]
[]
[]
[]
[]
[]
[]
[]
[]
[]
[]
[]
[]
[]
[]
[]
[]
[]
[]
[]
[]
[]
[]
[]
[]
[]
[]
[]
[]
[]
[]
[]
[]
[]
[]
[]
[]
[]
[]
[]
[]
[]
[]
[]
[]
[]
[]
[]
[]
[]
[]
[]
[]
[]
[]
[]
[]
[]
[]
[]
[]
[]
[]
[]
[]
[]
[]
[]
[]
[]
[]
[]
[]
[]
[]
[]
[]
[]
[]
[]
[]
[]
[]
[]
[]
[]
[]
[]
[]
[]
[]
[]
[]
[]
[]
[]
[]
[]
[]
[]
[]
[]
[]
[]
[]
[]
[]
[]
[]
[]
[]
[]
[]
[]
[]
[]
[]
[]
[]
[]
[]
[]
[]
[]
[]
[]
[]
[]
[]
[]
[]
[]
[]
[]
[]
[]
[]
[]
[]
[]
[]
[]
[]
[]
[]
[]
[]
[]
[]
[]
[]
[]
[]
[]
[]
[]
[]
[]
[]
[]
[]
[]
[]
[]
[]
[]
[]
[]
[]
[]
[]
[]
[]
[]
[]
[]
[]
[]
[]
[]
[]
[]
[]
[]
[]
[]
[]
[]
[]
[]
[]
[]
[]
[]
[]
[]
[]
[]
[]
[]
[]
[]
[]
[]
[]
[]
[]
[]
[]
[]
[]
[]
[]
[]
[]
[]
[]
[]
[]
[]
[]
[]
[]
[]
[]
[]
[]
[]
[]
[]
[]
[]
[]
[]
[]
[]
[]
[]
[]
[]
[]
[]
[]
[]
[]
[]
[]
[]
[]
[]
[]
[]
[]
[]
[]
[]
[]
[]
[]
[]
[]
[]
[]
[]
[]
[]
[]
[]
[]
[]
[]
[]
[]
[]
[]
[]
[]
[]
[]
[]
[]
[]
[]
[]
[]
[]
[]
[]
[]
[]
[]
[]
[]
[]
[]
[]
[]
[]
[]
[]
[]
[]
[]
[]
[]
[]
[]
[]
[]
[]
[]
[]
[]
[]
[]
[]
[]
[]
[]
[]
[]
[]
[]
[]
[]
[]
[]
[]
[]
[]
[]
[]
[]
[]
[]
[]
[]
[]
[]
[]
[]
[]
[]
[]
[]
[]
[]
[]
[]
[]
[]
[]
[]
[]
[]
[]
[]
[]
[]
[]
[]
[]
[]
[]
[]
[]
[]
[]
[]
[]
[]
[]
[]
[]
[]
[]
[]
[]
[]
[]
[]
[]
[]
[]
[]
[]
[]
[]
[]
[]
[]
[]
[]
[]
[]
[]
[]
[]
[]
[]
[]
[]
[]
[]
[]
[]
[]
[]
[]
[]
[]
[]
[]
[]
[]
[]
[]
[]
[]
[]
[]
[]
[]
[]
[]
[]
[]
[]
[]
[]
[]
[]
[]
[]
[]
[]
[]
[]
[]
[]
[]
[]
[]
[]
[]
[]
[]
[]
[]
[]
[]
[]
[]
[]
[]
[]
[]
[]
[]
[]
[]
[]
[]
[]
[]
[]
[]
[]
[]
[]
[]
[]
[]
[]
[]
[]
[]
[]
[]
[]
[]
[]
[]
[]
[]
[]
[]
[]
[]
[]
[]
[]
[]
[]
[]
[]
[]
[]
[]
[]
[]
[]
[]
[]
[]
[]
[]
[]
[]
[]
[]
[]
[]
[]
[]
[]
[]
[]
[]
[]
[]
[]
[]
[]
[]
[]
[]
[]
[]
[]
[]
[]
[]
[]
[]
[]
[]
[]
[]
[]
[]
[]
[]
[]
[]
[]
[]
[]
[]
[]
[]
[]
[]
[]
[]
[]
[]
[]
[]
[]
[]
[]
[]
[]
[]
[]
[]
[]
[]
[]
[]
[]
[]
[]
[]
[]
[]
[]
[]
[]
[]
[]
[]
[]
[]
[]
[]
[]
[]
[]
[]
[]
[]
[]
[]
[]
[]
[]
[]
[]
[]
[]
[]
[]
[]
[]
[]
[]
[]
[]
[]
[]
[]
[]
[]
[]
[]
[]
[]
[]
[]
[]
[]
[]
[]
[]
[]
[]
[]
[]
[]
[]
[]
[]
[]
[]
[]
[]
[]
[]
[]
[]
[]
[]
[]
[]
[]
[]
[]
[]
[]
[]
[]
[]
[]
[]
[]
[]
[]
[]
[]
[]
[]
[]
[]
[]
[]
[]
[]
[]
[]
[]
[]
[]
[]
[]
[]
[]
[]
[]
[]
[]
[]
[]
[]
[]
[]
[]
[]
[]
[]
[]
[]
[]
[]
[]
[]
[]
[]
[]
[]
[]
[]
[]
[]
[]
[]
[]
[]
[]
[]
[]
[]
[]
[]
[]
[]
[]
[]
[]
[]
[]
[]
[]
[]
[]
[]
[]
[]
[]
[]
[]
[]
[]
[]
[]
[]
[]
[]
[]
[]
[]
[]
[]
[]
[]
[]
[]
[]
[]
[]
[]
[]
[]
[]
[]
[]
[]
[]
[]
[]
[]
[]
[]
[]
[]
[]
[]
[]
[]
[]
[]
[]
[]
[]
[]
[]
[]
[]
[]
[]
[]
[]
[]
[]
[]
[]
[]
[]
[]
[]
[]
[]
[]
[]
[]
[]
[]
[]
[]
[]
[]
[]
[]
[]
[]
[]
[]
[]
[]
[]
[]
[]
[]
[]
[]
[]
[]
[]
[]
[]
[]
[]
[]
[]
[]
[]
[]
[]
[]
[]
[]
[]
[]
[]
[]
[]
[]
[]
[]
[]
[]
[]
[]
[]
[]
[]
[]
[]
[]
[]
[]
[]
[]
[]
[]
[]
[]
[]
[]
[]
[]
[]
[]
[]
[]
[]
[]
[]
[]
[]
[]
[]
[]
[]
[]
[]
[]
[]
[]
[]
[]
[]
[]
[]
[]
[]
[]
[]
[]
[]
[]
[]
[]
[]
[]
[]
[]
[]
[]
[]
[]
[]
[]
[]
[]
[]
[]
[]
[]
[]
[]
[]
[]
[]
[]
[]
[]
[]
[]
[]
[]
[]
[]
[]
[]
[]
[]
[]
[]
[]
[]
[]
[]
[]
[]
[]
[]
[]
[]
[]
[]
[]
[]
[]
[]
[]
[]
[]
[]
[]
[]
[]
[]
[]
[]
[]
[]
[]
[]
[]
[]
[]
[]
[]
[]
[]
[]
[]
[]
[]
[]
[]
[]
[]
[]
[]
[]
[]
[]
[]
[]
[]
[]
[]
[]
[]
[]
[]
[]
[]
[]
[]
[]
[]
[]
[]
[]
[]
[]
[]
[]
[]
[]
[]
[]
[]
[]
[]
[]
[]
[]
[]
[]
[]
[]
[]
[]
[]
[]
[]
[]
[]
[]
[]
[]
[]
[]
[]
[]
[]
[]
[]
[]
[]
[]
[]
[]
[]
[]
[]
[]
[]
[]
[]
[]
[]
[]
[]
[]
[]
[]
[]
[]
[]
[]
[]
[]
[]
[]
[]
[]
[]
[]
[]
[]
[]
[]
[]
[]
[]
[]
[]
[]
[]
[]
[]
[]
[]
[]
[]
[]
[]
[]
[]
[]
[]
[]
[]
[]
[]
[]
[]
[]
[]
[]
[]
[]
[]
[]
[]
[]
[]
[]
[]
[]
[]
[]
[]
[]
[]
[]
[]
[]
[]
[]
[]
[]
[]
[]
[]
[]
[]
[]
[]
[]
[]
[]
[]
[]
[]
[]
[]
[]
[]
[]
[]
[]
[]
[]
[]
[]
[]
[]
[]
[]
[]
[]
[]
[]
[]
[]
[]
[]
[]
[]
[]
[]
[]
[]
[]
[]
[]
[]
[]
[]
[]
[]
[]
[]
[]
[]
[]
[]
[]
[]
[]
[]
[]
[]
[]
[]
[]
[]
[]
[]
[]
[]
[]
[]
[]
[]
[]
[]
[]
[]
[]
[]
[]
[]
[]
[]
[]
[]
[]
[]
[]
[]
[]
[]
[]
[]
[]
[]
[]
[]
[]
[]
[]
[]
[]
[]
[]
[]
[]
[]
[]
[]
[]
[]
[]
[]
[]
[]
[]
[]
[]
[]
[]
[]
[]
[]
[]
[]
[]
[]
[]
[]
[]
[]
[]
[]
[]
[]
[]
[]
[]
[]
[]
[]
[]
[]
[]
[]
[]
[]
[]
[]
[]
[]
[]
[]
[]
[]
[]
[]
[]
[]
[]
[]
[]
[]
[]
[]
[]
[]
[]
[]
[]
[]
[]
[]
[]
[]
[]
[]
[]
[]
[]
[]
[]
[]
[]
[]
[]
[]
[]
[]
[]
[]
[]
[]
[]
[]
[]
[]
[]
[]
[]
[]
[]
[]
[]
[]
[]
[]
[]
[]
[]
[]
[]
[]
[]
[]
[]
[]
[]
[]
[]
[]
[]
[]
[]
[]
[]
[]
[]
[]
[]
[]
[]
[]
[]
[]
[]
[]
[]
[]
[]
[]
[]
[]
[]
[]
[]
[]
[]
[]
[]
[]
[]
[]
[]
[]
[]
[]
[]
[]
[]
[]
[]
[]
[]
[]
[]
[]
[]
[]
[]
[]
[]
[]
[]
[]
[]
[]
[]
[]
[]
[]
[]
[]
[]
[]
[]
[]
[]
[]
[]
[]
[]
[]
[]
[]
[]
[]
[]
[]
[]
[]
[]
[]
[]
[]
[]
[]
[]
[]
[]
[]
[]
[]
[]
[]
[]
[]
[]
[]
[]
[]
[]
[]
[]
[]
[]
[]
[]
[]
[]
[]
[]
[]
[]
[]
[]
[]
[]
[]
[]
[]
[]
[]
[]
[]
[]
[]
[]
[]
[]
[]
[]
[]
[]
[]
[]
[]
[]
[]
[]
[]
[]
[]
[]
[]
[]
[]
[]
[]
[]
[]
[]
[]
[]
[]
[]
[]
[]
[]
[]
[]
[]
[]
[]
[]
[]
[]
[]
[]
[]
[]
[]
[]
[]
[]
[]
[]
[]
[]
[]
[]
[]
[]
[]
[]
[]
[]
[]
[]
[]
[]
[]
[]
[]
[]
[]
[]
[]
[]
[]
[]
[]
[]
[]
[]
[]
[]
[]
[]
[]
[]
[]
[]
[]
[]
[]
[]
[]
[]
[]
[]
[]
[]
[]
[]
[]
[]
[]
[]
[]
[]
[]
[]
[]
[]
[]
[]
[]
[]
[]
[]
[]
[]
[]
[]
[]
[]
[]
[]
[]
[]
[]
[]
[]
[]
[]
[]
[]
[]
[]
[]
[]
[]
[]
[]
[]
[]
[]
[]
[]
[]
[]
[]
[]
[]
[]
[]
[]
[]
[]
[]
[]
[]
[]
[]
[]
[]
[]
[]
[]
[]
[]
[]
[]
[]
[]
[]
[]
[]
[]
[]
[]
[]
[]
[]
[]
[]
[]
[]
[]
[]
[]
[]
[]
[]
[]
[]
[]
[]
[]
[]
[]
[]
[]
[]
[]
[]
[]
[]
[]
[]
[]
[]
[]
[]
[]
[]
[]
[]
[]
[]
[]
[]
[]
[]
[]
[]
[]
[]
[]
[]
[]
[]
[]
[]
[]
[]
[]
[]
[]
[]
[]
[]
[]
[]
[]
[]
[]
[]
[]
[]
[]
[]
[]
[]
[]
[]
[]
[]
[]
[]
[]
[]
[]
[]
[]
[]
[]
[]
[]
[]
[]
[]
[]
[]
[]
[]
[]
[]
[]
[]
[]
[]
[]
[]
[]
[]
[]
[]
[]
[]
[]
[]
[]
[]
[]
[]
[]
[]
[]
[]
[]
[]
[]
[]
[]
[]
[]
[]
[]
[]
[]
[]
[]
[]
[]
[]
[]
[]
[]
[]
[]
[]
[]
[]
[]
[]
[]
[]
[]
[]
[]
[]
[]
[]
[]
[]
[]
[]
[]
[]
[]
[]
[]
[]
[]
[]
[]
[]
[]
[]
[]
[]
[]
[]
[]
[]
[]
[]
[]
[]
[]
[]
[]
[]
[]
[]
[]
[]
[]
[]
[]
[]
[]
[]
[]
[]
[]
[]
[]
[]
[]
[]
[]
[]
[]
[]
[]
[]
[]
[]
[]
[]
[]
[]
[]
[]
[]
[]
[]
[]
[]
[]
[]
[]
[]
[]
[]
[]
[]
[]
[]
[]
[]
[]
[]
[]
[]
[]
[]
[]
[]
[]
[]
[]
[]
[]
[]
[]
[]
[]
[]
[]
[]
[]
[]
[]
[]
[]
[]
[]
[]
[]
[]
[]
[]
[]
[]
[]
[]
[]
[]
[]
[]
[]
[]
[]
[]
[]
[]
[]
[]
[]
[]
[]
[]
[]
[]
[]
[]
[]
[]
[]
[]
[]
[]
[]
[]
[]
[]
[]
[]
[]
[]
[]
[]
[]
[]
[]
[]
[]
[]
[]
[]
[]
[]
[]
[]
[]
[]
[]
[]
[]
[]
[]
[]
[]
[]
[]
[]
[]
[]
[]
[]
[]
[]
[]
[]
[]
[]
[]
[]
[]
[]
[]
[]
[]
[]
[]
[]
[]
[]
[]
[]
[]
[]
[]
[]
[]
[]
[]
[]
[]
[]
[]
[]
[]
[]
[]
[]
[]
[]
[]
[]
[]
[]
[]
[]
[]
[]
[]
[]
[]
[]
[]
[]
[]
[]
[]
[]
[]
[]
[]
[]
[]
[]
[]
[]
[]
[]
[]
[]
[]
[]
[]
[]
[]
[]
[]
[]
[]
[]
[]
[]
[]
[]
[]
[]
[]
[]
[]
[]
[]
[]
[]
[]
[]
[]
[]
[]
[]
[]
[]
[]
[]
[]
[]
[]
[]
[]
[]
[]
[]
[]
[]
[]
[]
[]
[]
[]
[]
[]
[]
[]
[]
[]
[]
[]
[]
[]
[]
[]
[]
[]
[]
[]
[]
[]
[]
[]
[]
[]
[]
[]
[]
[]
[]
[]
[]
[]
[]
[]
[]
[]
[]
[]
[]
[]
[]
[]
[]
[]
[]
[]
[]
[]
[]
[]
[]
[]
[]
[]
[]
[]
[]
[]
[]
[]
[]
[]
[]
[]
[]
[]
[]
[]
[]
[]
[]
[]
[]
[]
[]
[]
[]
[]
[]
[]
[]
[]
[]
[]
[]
[]
[]
[]
[]
[]
[]
[]
[]
[]
[]
[]
[]
[]
[]
[]
[]
[]
[]
[]
[]
[]
[]
[]
[]
[]
[]
[]
[]
[]
[]
[]
[]
[]
[]
[]
[]
[]
[]
[]
[]
[]
[]
[]
[]
[]
[]
[]
[]
[]
[]
[]
[]
[]
[]
[]
[]
[]
[]
[]
[]
[]
[]
[]
[]
[]
[]
[]
[]
[]
[]
[]
[]
[]
[]
[]
[]
[]
[]
[]
[]
[]
[]
[]
[]
[]
[]
[]
[]
[]
[]
[]
[]
[]
[]
[]
[]
[]
[]
[]
[]
[]
[]
[]
[]
[]
[]
[]
[]
[]
[]
[]
[]
[]
[]
[]
[]
[]
[]
[]
[]
[]
[]
[]
[]
[]
[]
[]
[]
[]
[]
[]
[]
[]
[]
[]
[]
[]
[]
[]
[]
[]
[]
[]
[]
[]
[]
[]
[]
[]
[]
[]
[]
[]
[]
[]
[]
[]
[]
[]
[]
[]
[]
[]
[]
[]
[]
[]
[]
[]
[]
[]
[]
[]
[]
[]
[]
[]
[]
[]
[]
[]
[]
[]
[]
[]
[]
[]
[]
[]
[]
[]
[]
[]
[]
[]
[]
[]
[]
[]
[]
[]
[]
[]
[]
[]
[]
[]
[]
[]
[]
[]
[]
[]
[]
[]
[]
[]
[]
[]
[]
[]
[]
[]
[]
[]
[]
[]
[]
[]
[]
[]
[]
[]
[]
[]
[]
[]
[]
[]
[]
[]
[]
[]
[]
[]
[]
[]
[]
[]
[]
[]
[]
[]
[]
[]
[]
[]
[]
[]
[]
[]
[]
[]
[]
[]
[]
[]
[]
[]
[]
[]
[]
[]
[]
[]
[]
[]
[]
[]
[]
[]
[]
[]
[]
[]
[]
[]
[]
[]
[]
[]
[]
[]
[]
[]
[]
[]
[]
[]
[]
[]
[]
[]
[]
[]
[]
[]
[]
[]
[]
[]
[]
[]
[]
[]
[]
[]
[]
[]
[]
[]
[]
[]
[]
[]
[]
[]
[]
[]
[]
[]
[]
[]
[]
[]
[]
[]
[]
[]
[]
[]
[]
[]
[]
[]
[]
[]
[]
[]
[]
[]
[]
[]
[]
[]
[]
[]
[]
[]
[]
[]
[]
[]
[]
[]
[]
[]
[]
[]
[]
[]
[]
[]
[]
[]
[]
[]
[]
[]
[]
[]
[]
[]
[]
[]
[]
[]
[]
[]
[]
[]
[]
[]
[]
[]
[]
[]
[]
[]
[]
[]
[]
[]
[]
[]
[]
[]
[]
[]
[]
[]
[]
[]
[]
[]
[]
[]
[]
[]
[]
[]
[]
[]
[]
[]
[]
[]
[]
[]
[]
[]
[]
[]
[]
[]
[]
[]
[]
[]
[]
[]
[]
[]
[]
[]
[]
[]
[]
[]
[]
[]
[]
[]
[]
[]
[]
[]
[]
[]
[]
[]
[]
[]
[]
[]
[]
[]
[]
[]
[]
[]
[]
[]
[]
[]
[]
[]
[]
[]
[]
[]
[]
[]
[]
[]
[]
[]
[]
[]
[]
[]
[]
[]
[]
[]
[]
[]
[]
[]
[]
[]
[]
[]
[]
[]
[]
[]
[]
[]
[]
[]
[]
[]
[]
[]
[]
[]
[]
[]
[]
[]
[]
[]
[]
[]
[]
[]
[]
[]
[]
[]
[]
[]
[]
[]
[]
[]
[]
[]
[]
[]
[]
[]
[]
[]
[]
[]
[]
[]
[]
[]
[]
[]
[]
[]
[]
[]
[]
[]
[]
[]
[]
[]
[]
[]
[]
[]
[]
[]
[]
[]
[]
[]
[]
[]
[]
[]
[]
[]
[]
[]
[]
[]
[]
[]
[]
[]
[]
[]
[]
[]
[]
[]
[]
[]
[]
[]
[]
[]
[]
[]
[]
[]
[]
[]
[]
[]
[]
[]
[]
[]
[]
[]
[]
[]
[]
[]
[]
[]
[]
[]
[]
[]
[]
[]
[]
[]
[]
[]
[]
[]
[]
[]
[]
[]
[]
[]
[]
[]
[]
[]
[]
[]
[]
[]
[]
[]
[]
[]
[]
[]
[]
[]
[]
[]
[]
[]
[]
[]
[]
[]
[]
[]
[]
[]
[]
[]
[]
[]
[]
[]
[]
[]
[]
[]
[]
[]
[]
[]
[]
[]
[]
[]
[]
[]
[]
[]
[]
[]
[]
[]
[]
[]
[]
[]
[]
[]
[]
[]
[]
[]
[]
[]
[]
[]
[]
[]
[]
[]
[]
[]
[]
[]
[]
[]
[]
[]
[]
[]
[]
[]
[]
[]
[]
[]
[]
[]
[]
[]
[]
[]
[]
[]
[]
[]
[]
[]
[]
[]
[]
[]
[]
[]
[]
[]
[]
[]
[]
[]
[]
[]
[]
[]
[]
[]
[]
[]
[]
[]
[]
[]
[]
[]
[]
[]
[]
[]
[]
[]
[]
[]
[]
[]
[]
[]
[]
[]
[]
[]
[]
[]
[]
[]
[]
[]
[]
[]
[]
[]
[]
[]
[]
[]
[]
[]
[]
[]
[]
[]
[]
[]
[]
[]
[]
[]
[]
[]
[]
[]
[]
[]
[]
[]
[]
[]
[]
[]
[]
[]
[]
[]
[]
[]
[]
[]
[]
[]
[]
[]
[]
[]
[]
[]
[]
[]
[]
[]
[]
[]
[]
[]
[]
[]
[]
[]
[]
[]
[]
[]
[]
[]
[]
[]
[]
[]
[]
[]
[]
[]
[]
[]
[]
[]
[]
[]
[]
[]
[]
[]
[]
[]
[]
[]
[]
[]
[]
[]
[]
[]
[]
[]
[]
[]
[]
[]
[]
[]
[]
[]
[]
[]
[]
[]
[]
[]
[]
[]
[]
[]
[]
[]
[]
[]
[]
[]
[]
[]
[]
[]
[]
[]
[]
[]
[]
[]
[]
[]
[]
[]
[]
[]
[]
[]
[]
[]
[]
[]
[]
[]
[]
[]
[]
[]
[]
[]
[]
[]
[]
[]
[]
[]
[]
[]
[]
[]
[]
[]
[]
[]
[]
[]
[]
[]
[]
[]
[]
[]
[]
[]
[]
[]
[]
[]
[]
[]
[]
[]
[]
[]
[]
[]
[]
[]
[]
[]
[]
[]
[]
[]
[]
[]
[]
[]
[]
[]
[]
[]
[]
[]
[]
[]
[]
[]
[]
[]
[]
[]
[]
[]
[]
[]
[]
[]
[]
[]
[]
[]
[]
[]
[]
[]
[]
[]
[]
[]
[]
[]
[]
[]
[]
[]
[]
[]
[]
[]
[]
[]
[]
[]
[]
[]
[]
[]
[]
[]
[]
[]
[]
[]
[]
[]
[]
[]
[]
[]
[]
[]
[]
[]
[]
[]
[]
[]
[]
[]
[]
[]
[]
[]
[]
[]
[]
[]
[]
[]
[]
[]
[]
[]
[]
[]
[]
[]
[]
[]
[]
[]
[]
[]
[]
[]
[]
[]
[]
[]
[]
[]
[]
[]
[]
[]
[]
[]
[]
[]
[]
[]
[]
[]
[]
[]
[]
[]
[]
[]
[]
[]
[]
[]
[]
[]
[]
[]
[]
[]
[]
[]
[]
[]
[]
[]
[]
[]
[]
[]
[]
[]
[]
[]
[]
[]
[]
[]
[]
[]
[]
[]
[]
[]
[]
[]
[]
[]
[]
[]
[]
[]
[]
[]
[]
[]
[]
[]
[]
[]
[]
[]
[]
[]
[]
[]
[]
[]
[]
[]
[]
[]
[]
[]
[]
[]
[]
[]
[]
[]
[]
[]
[]
[]
[]
[]
[]
[]
[]
[]
[]
[]
[]
[]
[]
[]
[]
[]
[]
[]
[]
[]
[]
[]
[]
[]
[]
[]
[]
[]
[]
[]
[]
[]
[]
[]
[]
[]
[]
[]
[]
[]
[]
[]
[]
[]
[]
[]
[]
[]
[]
[]
[]
[]
[]
[]
[]
[]
[]
[]
[]
[]
[]
[]
[]
[]
[]
[]
[]
[]
[]
[]
[]
[]
[]
[]
[]
[]
[]
[]
[]
[]
[]
[]
[]
[]
[]
[]
[]
[]
[]
[]
[]
[]
[]
[]
[]
[]
[]
[]
[]
[]
[]
[]
[]
[]
[]
[]
[]
[]
[]
[]
[]
[]
[]
[]
[]
[]
[]
[]
[]
[]
[]
[]
[]
[]
[]
[]
[]
[]
[]
[]
[]
[]
[]
[]
[]
[]
[]
[]
[]
[]
[]
[]
[]
[]
[]
[]
[]
[]
[]
[]
[]
[]
[]
[]
[]
[]
[]
[]
[]
[]
[]
[]
[]
[]
[]
[]
[]
[]
[]
[]
[]
[]
[]
[]
[]
[]
[]
[]
[]
[]
[]
[]
[]
[]
[]
[]
[]
[]
[]
[]
[]
[]
[]
[]
[]
[]
[]
[]
[]
[]
[]
[]
[]
[]
[]
[]
[]
[]
[]
[]
[]
[]
[]
[]
[]
[]
[]
[]
[]
[]
[]
[]
[]
[]
[]
[]
[]
[]
[]
[]
[]
[]
[]
[]
[]
[]
[]
[]
[]
[]
[]
[]
[]
[]
[]
[]
[]
[]
[]
[]
[]
[]
[]
[]
[]
[]
[]
[]
[]
[]
[]
[]
[]
[]
[]
[]
[]
[]
[]
[]
[]
[]
[]
[]
[]
[]
[]
[]
[]
[]
[]
[]
[]
[]
[]
[]
[]
[]
[]
[]
[]
[]
[]
[]
[]
[]
[]
[]
[]
[]
[]
[]
[]
[]
[]
[]
[]
[]
[]
[]
[]
[]
[]
[]
[]
[]
[]
[]
[]
[]
[]
[]
[]
[]
[]
[]
[]
[]
[]
[]
[]
[]
[]
[]
[]
[]
[]
[]
[]
[]
[]
[]
[]
[]
[]
[]
[]
[]
[]
[]
[]
[]
[]
[]
[]
[]
[]
[]
[]
[]
[]
[]
[]
[]
[]
[]
[]
[]
[]
[]
[]
[]
[]
[]
[]
[]
[]
[]
[]
[]
[]
[]
[]
[]
[]
[]
[]
[]
[]
[]
[]
[]
[]
[]
[]
[]
[]
[]
[]
[]
[]
[]
[]
[]
[]
[]
[]
[]
[]
[]
[]
[]
[]
[]
[]
[]
[]
[]
[]
[]
[]
[]
[]
[]
[]
[]
[]
[]
[]
[]
[]
[]
[]
[]
[]
[]
[]
[]
[]
[]
[]
[]
[]
[]
[]
[]
[]
[]
[]
[]
[]
[]
[]
[]
[]
[]
[]
[]
[]
[]
[]
[]
[]
[]
[]
[]
[]
[]
[]
[]
[]
[]
[]
[]
[]
[]
[]
[]
[]
[]
[]
[]
[]
[]
[]
[]
[]
[]
[]
[]
[]
[]
[]
[]
[]
[]
[]
[]
[]
[]
[]
[]
[]
[]
[]
[]
[]
[]
[]
[]
[]
[]
[]
[]
[]
[]
[]
[]
[]
[]
[]
[]
[]
[]
[]
[]
[]
[]
[]
[]
[]
[]
[]
[]
[]
[]
[]
[]
[]
[]
[]
[]
[]
[]
[]
[]
[]
[]
[]
[]
[]
[]
[]
[]
[]
[]
[]
[]
[]
[]
[]
[]
[]
[]
[]
[]
[]
[]
[]
[]
[]
[]
[]
[]
[]
[]
[]
[]
[]
[]
[]
[]
[]
[]
[]
[]
[]
[]
[]
[]
[]
[]
[]
[]
[]
[]
[]
[]
[]
[]
[]
[]
[]
[]
[]
[]
[]
[]
[]
[]
[]
[]
[]
[]
[]
[]
[]
[]
[]
[]
[]
[]
[]
[]
[]
[]
[]
[]
[]
[]
[]
[]
[]
[]
[]
[]
[]
[]
[]
[]
[]
[]
[]
[]
[]
[]
[]
[]
[]
[]
[]
[]
[]
[]
[]
[]
[]
[]
[]
[]
[]
[]
[]
[]
[]
[]
[]
[]
[]
[]
[]
[]
[]
[]
[]
[]
[]
[]
[]
[]
[]
[]
[]
[]
[]
[]
[]
[]
[]
[]
[]
[]
[]
[]
[]
[]
[]
[]
[]
[]
[]
[]
[]
[]
[]
[]
[]
[]
[]
[]
[]
[]
[]
[]
[]
[]
[]
[]
[]
[]
[]
[]
[]
[]
[]
[]
[]
[]
[]
[]
[]
[]
[]
[]
[]
[]
[]
[]
[]
[]
[]
[]
[]
[]
[]
[]
[]
[]
[]
[]
[]
[]
[]
[]
[]
[]
[]
[]
[]
[]
[]
[]
[]
[]
[]
[]
[]
[]
[]
[]
[]
[]
[]
[]
[]
[]
[]
[]
[]
[]
[]
[]
[]
[]
[]
[]
[]
[]
[]
[]
[]
[]
[]
[]
[]
[]
[]
[]
[]
[]
[]
[]
[]
[]
[]
[]
[]
[]
[]
[]
[]
[]
[]
[]
[]
[]
[]
[]
[]
[]
[]
[]
[]
[]
[]
[]
[]
[]
[]
[]
[]
[]
[]
[]
[]
[]
[]
[]
[]
[]
[]
[]
[]
[]
[]
[]
[]
[]
[]
[]
[]
[]
[]
[]
[]
[]
[]
[]
[]
[]
[]
[]
[]
[]
[]
[]
[]
[]
[]
[]
[]
[]
[]
[]
[]
[]
[]
[]
[]
[]
[]
[]
[]
[]
[]
[]
[]
[]
[]
[]
[]
[]
[]
[]
[]
[]
[]
[]
[]
[]
[]
[]
[]
[]
[]
[]
[]
[]
[]
[]
[]
[]
[]
[]
[]
[]
[]
[]
[]
[]
[]
[]
[]
[]
[]
[]
[]
[]
[]
[]
[]
[]
[]
[]
[]
[]
[]
[]
[]
[]
[]
[]
[]
[]
[]
[]
[]
[]
[]
[]
[]
[]
[]
[]
[]
[]
[]
[]
[]
[]
[]
[]
[]
[]
[]
[]
[]
[]
[]
[]
[]
[]
[]
[]
[]
[]
[]
[]
[]
[]
[]
[]
[]
[]
[]
[]
[]
[]
[]
[]
[]
[]
[]
[]
[]
[]
[]
[]
[]
[]
[]
[]
[]
[]
[]
[]
[]
[]
[]
[]
[]
[]
[]
[]
[]
[]
[]
[]
[]
[]
[]
[]
[]
[]
[]
[]
[]
[]
[]
[]
[]
[]
[]
[]
[]
[]
[]
[]
[]
[]
[]
[]
[]
[]
[]
[]
[]
[]
[]
[]
[]
[]
[]
[]
[]
[]
[]
[]
[]
[]
[]
[]
[]
[]
[]
[]
[]
[]
[]
[]
[]
[]
[]
[]
[]
[]
[]
[]
[]
[]
[]
[]
[]
[]
[]
[]
[]
[]
[]
[]
[]
[]
[]
[]
[]
[]
[]
[]
[]
[]
[]
[]
[]
[]
[]
[]
[]
[]
[]
[]
[]
[]
[]
[]
[]
[]
[]
[]
[]
[]
[]
[]
[]
[]
[]
[]
[]
[]
[]
[]
[]
[]
[]
[]
[]
[]
[]
[]
[]
[]
[]
[]
[]
[]
[]
[]
[]
[]
[]
[]
[]
[]
[]
[]
[]
[]
[]
[]
[]
[]
[]
[]
[]
[]
[]
[]
[]
[]
[]
[]
[]
[]
[]
[]
[]
[]
[]
[]
[]
[]
[]
[]
[]
[]
[]
[]
[]
[]
[]
[]
[]
[]
[]
[]
[]
[]
[]
[]
[]
[]
[]
[]
[]
[]
[]
[]
[]
[]
[]
[]
[]
[]
[]
[]
[]
[]
[]
[]
[]
[]
[]
[]
[]
[]
[]
[]
[]
[]
[]
[]
[]
[]
[]
[]
[]
[]
[]
[]
[]
[]
[]
[]
[]
[]
[]
[]
[]
[]
[]
[]
[]
[]
[]
[]
[]
[]
[]
[]
[]
[]
[]
[]
[]
[]
[]
[]
[]
[]
[]
[]
[]
[]
[]
[]
[]
[]
[]
[]
[]
[]
[]
[]
[]
[]
[]
[]
[]
[]
[]
[]
[]
[]
[]
[]
[]
[]
[]
[]
[]
[]
[]
[]
[]
[]
[]
[]
[]
[]
[]
[]
[]
[]
[]
[]
[]
[]
[]
[]
[]
[]
[]
[]
[]
[]
[]
[]
[]
[]
[]
[]
[]
[]
[]
[]
[]
[]
[]
[]
[]
[]
[]
[]
[]
[]
[]
[]
[]
[]
[]
[]
[]
[]
[]
[]
[]
[]
[]
[]
[]
[]
[]
[]
[]
[]
[]
[]
[]
[]
[]
[]
[]
[]
[]
[]
[]
[]
[]
[]
[]
[]
[]
[]
[]
[]
[]
[]
[]
[]
[]
[]
[]
[]
[]
[]
[]
[]
[]
[]
[]
[]
[]
[]
[]
[]
[]
[]
[]
[]
[]
[]
[]
[]
[]
[]
[]
[]
[]
[]
[]
[]
[]
[]
[]
[]
[]
[]
[]
[]
[]
[]
[]
[]
[]
[]
[]
[]
[]
[]
[]
[]
[]
[]
[]
[]
[]
[]
[]
[]
[]
[]
[]
[]
[]
[]
[]
[]
[]
[]
[]
[]
[]
[]
[]
[]
[]
[]
[]
[]
[]
[]
[]
[]
[]
[]
[]
[]
[]
[]
[]
[]
[]
[]
[]
[]
[]
[]
[]
[]
[]
[]
[]
[]
[]
[]
[]
[]
[]
[]
[]
[]
[]
[]
[]
[]
[]
[]
[]
[]
[]
[]
[]
[]
[]
[]
[]
[]
[]
[]
[]
[]
[]
[]
[]
[]
[]
[]
[]
[]
[]
[]
[]
[]
[]
[]
[]
[]
[]
[]
[]
[]
[]
[]
[]
[]
[]
[]
[]
[]
[]
[]
[]
[]
[]
[]
[]
[]
[]
[]
[]
[]
[]
[]
[]
[]
[]
[]
[]
[]
[]
[]
[]
[]
[]
[]
[]
[]
[]
[]
[]
[]
[]
[]
[]
[]
[]
[]
[]
[]
[]
[]
[]
[]
[]
[]
[]
[]
[]
[]
[]
[]
[]
[]
[]
[]
[]
[]
[]
[]
[]
[]
[]
[]
[]
[]
[]
[]
[]
[]
[]
[]
[]
[]
[]
[]
[]
[]
[]
[]
[]
[]
[]
[]
[]
[]
[]
[]
[]
[]
[]
[]
[]
[]
[]
[]
[]
[]
[]
[]
[]
[]
[]
[]
[]
[]
[]
[]
[]
[]
[]
[]
[]
[]
[]
[]
[]
[]
[]
[]
[]
[]
[]
[]
[]
[]
[]
[]
[]
[]
[]
[]
[]
[]
[]
[]
[]
[]
[]
[]
[]
[]
[]
[]
[]
[]
[]
[]
[]
[]
[]
[]
[]
[]
[]
[]
[]
[]
[]
[]
[]
[]
[]
[]
[]
[]
[]
[]
[]
[]
[]
[]
[]
[]
[]
[]
[]
[]
[]
[]
[]
[]
[]
[]
[]
[]
[]
[]
[]
[]
[]
[]
[]
[]
[]
[]
[]
[]
[]
[]
[]
[]
[]
[]
[]
[]
[]
[]
[]
[]
[]
[]
[]
[]
[]
[]
[]
[]
[]
[]
[]
[]
[]
[]
[]
[]
[]
[]
[]
[]
[]
[]
[]
[]
[]
[]
[]
[]
[]
[]
[]
[]
[]
[]
[]
[]
[]
[]
[]
[]
[]
[]
[]
[]
[]
[]
[]
[]
[]
[]
[]
[]
[]
[]
[]
[]
[]
[]
[]
[]
[]
[]
[]
[]
[]
[]
[]
[]
[]
[]
[]
[]
[]
[]
[]
[]
[]
[]
[]
[]
[]
[]
[]
[]
[]
[]
[]
[]
[]
[]
[]
[]
[]
[]
[]
[]
[]
[]
[]
[]
[]
[]
[]
[]
[]
[]
[]
[]
[]
[]
[]
[]
[]
[]
[]
[]
[]
[]
[]
[]
[]
[]
[]
[]
[]
[]
[]
[]
[]
[]
[]
[]
[]
[]
[]
[]
[]
[]
[]
[]
[]
[]
[]
[]
[]
[]
[]
[]
[]
[]
[]
[]
[]
[]
[]
[]
[]
[]
[]
[]
[]
[]
[]
[]
[]
[]
[]
[]
[]
[]
[]
[]
[]
[]
[]
[]
[]
[]
[]
[]
[]
[]
[]
[]
[]
[]
[]
[]
[]
[]
[]
[]
[]
[]
[]
[]
[]
[]
[]
[]
[]
[]
[]
[]
[]
[]
[]
[]
[]
[]
[]
[]
[]
[]
[]
[]
[]
[]
[]
[]
[]
[]
[]
[]
[]
[]
[]
[]
[]
[]
[]
[]
[]
[]
[]
[]
[]
[]
[]
[]
[]
[]
[]
[]
[]
[]
[]
[]
[]
[]
[]
[]
[]
[]
[]
[]
[]
[]
[]
[]
[]
[]
[]
[]
[]
[]
[]
[]
[]
[]
[]
[]
[]
[]
[]
[]
[]
[]
[]
[]
[]
[]
[]
[]
[]
[]
[]
[]
[]
[]
[]
[]
[]
[]
[]
[]
[]
[]
[]
[]
[]
[]
[]
[]
[]
[]
[]
[]
[]
[]
[]
[]
[]
[]
[]
[]
[]
[]
[]
[]
[]
[]
[]
[]
[]
[]
[]
[]
[]
[]
[]
[]
[]
[]
[]
[]
[]
[]
[]
[]
[]
[]
[]
[]
[]
[]
[]
[]
[]
[]
[]
[]
[]
[]
[]
[]
[]
[]
[]
[]
[]
[]
[]
[]
[]
[]
[]
[]
[]
[]
[]
[]
[]
[]
[]
[]
[]
[]
[]
[]
[]
[]
[]
[]
[]
[]
[]
[]
[]
[]
[]
[]
[]
[]
[]
[]
[]
[]
[]
[]
[]
[]
[]
[]
[]
[]
[]
[]
[]
[]
[]
[]
[]
[]
[]
[]
[]
[]
[]
[]
[]
[]
[]
[]
[]
[]
[]
[]
[]
[]
[]
[]
[]
[]
[]
[]
[]
[]
[]
[]
[]
[]
[]
[]
[]
[]
[]
[]
[]
[]
[]
[]
[]
[]
[]
[]
[]
[]
[]
[]
[]
[]
[]
[]
[]
[]
[]
[]
[]
[]
[]
[]
[]
[]
[]
[]
[]
[]
[]
[]
[]
[]
[]
[]
[]
[]
[]
[]
[]
[]
[]
[]
[]
[]
[]
[]
[]
[]
[]
[]
[]
[]
[]
[]
[]
[]
[]
[]
[]
[]
[]
[]
[]
[]
[]
[]
[]
[]
[]
[]
[]
[]
[]
[]
[]
[]
[]
[]
[]
[]
[]
[]
[]
[]
[]
[]
[]
[]
[]
[]
[]
[]
[]
[]
[]
[]
[]
[]
[]
[]
[]
[]
[]
[]
[]
[]
[]
[]
[]
[]
[]
[]
[]
[]
[]
[]
[]
[]
[]
[]
[]
[]
[]
[]
[]
[]
[]
[]
[]
[]
[]
[]
[]
[]
[]
[]
[]
[]
[]
[]
[]
[]
[]
[]
[]
[]
[]
[]
[]
[]
[]
[]
[]
[]
[]
[]
[]
[]
[]
[]
[]
[]
[]
[]
[]
[]
[]
[]
[]
[]
[]
[]
[]
[]
[]
[]
[]
[]
[]
[]
[]
[]
[]
[]
[]
[]
[]
[]
[]
[]
[]
[]
[]
[]
[]
[]
[]
[]
[]
[]
[]
[]
[]
[]
[]
[]
[]
[]
[]
[]
[]
[]
[]
[]
[]
[]
[]
[]
[]
[]
[]
[]
[]
[]
[]
[]
[]
[]
[]
[]
[]
[]
[]
[]
[]
[]
[]
[]
[]
[]
[]
[]
[]
[]
[]
[]
[]
[]
[]
[]
[]
[]
[]
[]
[]
[]
[]
[]
[]
[]
[]
[]
[]
[]
[]
[]
[]
[]
[]
[]
[]
[]
[]
[]
[]
[]
[]
[]
[]
[]
[]
[]
[]
[]
[]
[]
[]
[]
[]
[]
[]
[]
[]
[]
[]
[]
[]
[]
[]
[]
[]
[]
[]
[]
[]
[]
[]
[]
[]
[]
[]
[]
[]
[]
[]
[]
[]
[]
[]
[]
[]
[]
[]
[]
[]
[]
[]
[]
[]
[]
[]
[]
[]
[]
[]
[]
[]
[]
[]
[]
[]
[]
[]
[]
[]
[]
[]
[]
[]
[]
[]
[]
[]
[]
[]
[]
[]
[]
[]
[]
[]
[]
[]
[]
[]
[]
[]
[]
[]
[]
[]
[]
[]
[]
[]
[]
[]
[]
[]
[]
[]
[]
[]
[]
[]
[]
[]
[]
[]
[]
[]
[]
[]
[]
[]
[]
[]
[]
[]
[]
[]
[]
[]
[]
[]
[]
[]
[]
[]
[]
[]
[]
[]
[]
[]
[]
[]
[]
[]
[]
[]
[]
[]
[]
[]
[]
[]
[]
[]
[]
[]
[]
[]
[]
[]
[]
[]
[]
[]
[]
[]
[]
[]
[]
[]
[]
[]
[]
[]
[]
[]
[]
[]
[]
[]
[]
[]
[]
[]
[]
[]
[]
[]
[]
[]
[]
[]
[]
[]
[]
[]
[]
[]
[]
[]
[]
[]
[]
[]
[]
[]
[]
[]
[]
[]
[]
[]
[]
[]
[]
[]
[]
[]
[]
[]
[]
[]
[]
[]
[]
[]
[]
[]
[]
[]
[]
[]
[]
[]
[]
[]
[]
[]
[]
[]
[]
[]
[]
[]
[]
[]
[]
[]
[]
[]
[]
[]
[]
[]
[]
[]
[]
[]
[]
[]
[]
[]
[]
[]
[]
[]
[]
[]
[]
[]
[]
[]
[]
[]
[]
[]
[]
[]
[]
[]
[]
[]
[]
[]
[]
[]
[]
[]
[]
[]
[]
[]
[]
[]
[]
[]
[]
[]
[]
[]
[]
[]
[]
[]
[]
[]
[]
[]
[]
[]
[]
[]
[]
[]
[]
[]
[]
[]
[]
[]
[]
[]
[]
[]
[]
[]
[]
[]
[]
[]
[]
[]
[]
[]
[]
[]
[]
[]
[]
[]
[]
[]
[]
[]
[]
[]
[]
[]
[]
[]
[]
[]
[]
[]
[]
[]
[]
[]
[]
[]
[]
[]
[]
[]
[]
[]
[]
[]
[]
[]
[]
[]
[]
[]
[]
[]
[]
[]
[]
[]
[]
[]
[]
[]
[]
[]
[]
[]
[]
[]
[]
[]
[]
[]
[]
[]
[]
[]
[]
[]
[]
[]
[]
[]
[]
[]
[]
[]
[]
[]
[]
[]
[]
[]
[]
[]
[]
[]
[]
[]
[]
[]
[]
[]
[]
[]
[]
[]
[]
[]
[]
[]
[]
[]
[]
[]
[]
[]
[]
[]
[]
[]
[]
[]
[]
[]
[]
[]
[]
[]
[]
[]
[]
[]
[]
[]
[]
[]
[]
[]
[]
[]
[]
[]
[]
[]
[]
[]
[]
[]
[]
[]
[]
[]
[]
[]
[]
[]
[]
[]
[]
[]
[]
[]
[]
[]
[]
[]
[]
[]
[]
[]
[]
[]
[]
[]
[]
[]
[]
[]
[]
[]
[]
[]
[]
[]
[]
[]
[]
[]
[]
[]
[]
[]
[]
[]
[]
[]
[]
[]
[]
[]
[]
[]
[]
[]
[]
[]
[]
[]
[]
[]
[]
[]
[]
[]
[]
[]
[]
[]
[]
[]
[]
[]
[]
[]
[]
[]
[]
[]
[]
[]
[]
[]
[]
[]
[]
[]
[]
[]
[]
[]
[]
[]
[]
[]
[]
[]
[]
[]
[]
[]
[]
[]
[]
[]
[]
[]
[]
[]
[]
[]
[]
[]
[]
[]
[]
[]
[]
[]
[]
[]
[]
[]
[]
[]
[]
[]
[]
[]
[]
[]
[]
[]
[]
[]
[]
[]
[]
[]
[]
[]
[]
[]
[]
[]
[]
[]
[]
[]
[]
[]
[]
[]
[]
[]
[]
[]
[]
[]
[]
[]
[]
[]
[]
[]
[]
[]
[]
[]
[]
[]
[]
[]
[]
[]
[]
[]
[]
[]
[]
[]
[]
[]
[]
[]
[]
[]
[]
[]
[]
[]
[]
[]
[]
[]
[]
[]
[]
[]
[]
[]
[]
[]
[]
[]
[]
[]
[]
[]
[]
[]
[]
[]
[]
[]
[]
[]
[]
[]
[]
[]
[]
[]
[]
[]
[]
[]
[]
[]
[]
[]
[]
[]
[]
[]
[]
[]
[]
[]
[]
[]
[]
[]
[]
[]
[]
[]
[]
[]
[]
[]
[]
[]
[]
[]
[]
[]
[]
[]
[]
[]
[]
[]
[]
[]
[]
[]
[]
[]
[]
[]
[]
[]
[]
[]
[]
[]
[]
[]
[]
[]
[]
[]
[]
[]
[]
[]
[]
[]
[]
[]
[]
[]
[]
[]
[]
[]
[]
[]
[]
[]
[]
[]
[]
[]
[]
[]
[]
[]
[]
[]
[]
[]
[]
[]
[]
[]
[]
[]
[]
[]
[]
[]
[]
[]
[]
[]
[]
[]
[]
[]
[]
[]
[]
[]
[]
[]
[]
[]
[]
[]
[]
[]
[]
[]
[]
[]
[]
[]
[]
[]
[]
[]
[]
[]
[]
[]
[]
[]
[]
[]
[]
[]
[]
[]
[]
[]
[]
[]
[]
[]
[]
[]
[]
[]
[]
[]
[]
[]
[]
[]
[]
[]
[]
[]
[]
[]
[]
[]
[]
[]
[]
[]
[]
[]
[]
[]
[]
[]
[]
[]
[]
[]
[]
[]
[]
[]
[]
[]
[]
[]
[]
[]
[]
[]
[]
[]
[]
[]
[]
[]
[]
[]
[]
[]
[]
[]
[]
[]
[]
[]
[]
[]
[]
[]
[]
[]
[]
[]
[]
[]
[]
[]
[]
[]
[]
[]
[]
[]
[]
[]
[]
[]
[]
[]
[]
[]
[]
[]
[]
[]
[]
[]
[]
[]
[]
[]
[]
[]
[]
[]
[]
[]
[]
[]
[]
[]
[]
[]
[]
[]
[]
[]
[]
[]
[]
[]
[]
[]
[]
[]
[]
[]
[]
[]
[]
[]
[]
[]
[]
[]
[]
[]
[]
[]
[]
[]
[]
[]
[]
[]
[]
[]
[]
[]
[]
[]
[]
[]
[]
[]
[]
[]
[]
[]
[]
[]
[]
[]
[]
[]
[]
[]
[]
[]
[]
[]
[]
[]
[]
[]
[]
[]
[]
[]
[]
[]
[]
[]
[]
[]
[]
[]
[]
[]
[]
[]
[]
[]
[]
[]
[]
[]
[]
[]
[]
[]
[]
[]
[]
[]
[]
[]
[]
[]
[]
[]
[]
[]
[]
[]
[]
[]
[]
[]
[]
[]
[]
[]
[]
[]
[]
[]
[]
[]
[]
[]
[]
[]
[]
[]
[]
[]
[]
[]
[]
[]
[]
[]
[]
[]
[]
[]
[]
[]
[]
[]
[]
[]
[]
[]
[]
[]
[]
[]
[]
[]
[]
[]
[]
[]
[]
[]
[]
[]
[]
[]
[]
[]
[]
[]
[]
[]
[]
[]
[]
[]
[]
[]
[]
[]
[]
[]
[]
[]
[]
[]
[]
[]
[]
[]
[]
[]
[]
[]
[]
[]
[]
[]
[]
[]
[]
[]
[]
[]
[]
[]
[]
[]
[]
[]
[]
[]
[]
[]
[]
[]
[]
[]
[]
[]
[]
[]
[]
[]
[]
[]
[]
[]
[]
[]
[]
[]
[]
[]
[]
[]
[]
[]
[]
[]
[]
[]
[]
[]
[]
[]
[]
[]
[]
[]
[]
[]
[]
[]
[]
[]
[]
[]
[]
[]
[]
[]
[]
[]
[]
[]
[]
[]
[]
[]
[]
[]
[]
[]
[]
[]
[{"$f":"IF(Accueil!$D$10<>\"\",DATE(Accueil!$D$10,1,1),\"\")","v":""}]

{"sheet":"Modification","index":2,"n_rows":22,"n_cols":27,"rows_kept":22,"cut":false,"hidden":true,"merged":[[1,0,3,0],[1,4,3,4],[1,5,3,5],[1,6,3,6],[1,8,3,8],[1,21,3,21],[21,13,24,14],[11,1,11,2],[11,5,11,6],[12,10,14,10],[17,10,19,10],[20,9,20,10],[21,11,24,12],[1,11,3,11],[1,13,3,13],[1,14,3,14],[1,16,3,16],[10,11,10,12],[10,13,10,14],[9,5,9,7],[1,10,3,10]]}
["Date","Date1","Mois","Num ordre","Num consultant","Age","Gr.  Age","Gr.  Age1","Sexe","Sexe1","Sit. Matr","Bénéficiaires","Bénéficiaires1","Cas","Synd. IST","Synd. IST1 ","Prise ATB","Bilans prescrits","Résultats","Traitements","Quantité ","Observations","Section","Stratégie","Site","Trimestre","Semestre"]
[{"$f":"IF(C10<>\"\",C10,\"\")","v":""},{"$f":"IF(A2<>\"\",A2,\"\")","v":""},{"$f":"IF(B2<>\"\",INDEX([0]!Mois_date,MONTH(B2),1),\"\")","v":""},{"$f":"IF(Num_ligne=0,\"\",INDEX(Bd_num,Num_ligne,1))","v":""},{"$f":"IF($D$2<>\"\",Accueil!$D$11&+\"-\"&+$D$2&+\"-\"&+ MID(Accueil!$D$10,1,4),\"\")","v":""},{"$f":"IF(E13<>\"\",E13,C13)","v":""},{"$f":"IF(F2=\"\",\"\",IF(F2>49,\"50et+\",IF(F2>39,\"40-49\",IF(F2>29,\"30-39\",IF(F2>19,\"20-29\",IF(F2>14,\"15-19\",\"\"))))))","v":""},{"$f":"G2","v":""},{"$f":"C15&\"\"","v":""},{"$f":"I2","v":""},{"$f":"IF(E19<>\"\",E19,C19)","v":""},{"$f":"IF(E17<>\"\",E17,C17)","v":""},{"$f":"IF(L2<>\"\",L2,\"\")","v":""},{"$f":"IF(H13<>\"\",H13,G13)","v":""},{"$f":"IF(H15<>\"\",H15,G15)","v":""},{"$f":"IF(O2<>\"\",O2,\"\")","v":""},{"$f":"IF(H17<>\"\",H17,G17)","v":""},{"$f":"IF(N13<>\"\",N13,L13)","v":""},"",{"$f":"IF(N18<>\"\",N18,L18)","v":""},"",{"$f":"IF(N22<>\"\",N22,\"\")","v":""},{"$f":"IF(Accueil!$D$9<>\"\",Accueil!$D$9,\"\")","v":""},{"$f":"IF($E$8<>\"\",$E$8,Strategie)","v":""},{"$f":"IF($H$8<>\"\",$H$8,$G$8)","v":""},{"$f":"IF(OR(C2=\"Janvier\",C2=\"Février\",C2=\"Mars\"),\"Trimestre 1\",IF(OR(C2=\"Avril\",C2=\"Mai\",C2=\"Juin\"),\"Trimestre 2\",IF(OR(C2=\"Juillet\",C2=\"Août\",C2=\"Septembre\"),\"Trimestre 3\",IF(OR(C2=\"Octobre\",C2=\"Novembre\",C2=\"Décembre\"),\"Trimestre 4\",\"\"))))","v":""},{"$f":"IF(OR(Z2=\"Trimestre 1\",Z2=\"Trimestre 2\"),\"Semestre 1\",IF(OR(Z2=\"Trimestre 3\",Z2=\"Trimestre 4\"),\"Semestre 2\",\"\"))","v":""}]
[null,{"$f":"IF(A2<>\"\",A2,\"\")","v":""},{"$f":"IF(B3<>\"\",INDEX([0]!Mois_date,MONTH(B3),1),\"\")","v":""},{"$f":"IF(Num_ligne=0,\"\",INDEX(Bd_num,Num_ligne,1))","v":""},null,null,null,{"$f":"H2","v":""},null,{"$f":"J2","v":""},null,null,{"$f":"IF(L2<>\"\",L2,\"\")","v":""},null,null,{"$f":"IF(O2<>\"\",O2,\"\")","v":""},null,"","","","",null,{"$f":"IF(Accueil!$D$9<>\"\",Accueil!$D$9,\"\")","v":""},{"$f":"IF($E$8<>\"\",$E$8,Strategie)","v":""},{"$f":"IF($H$8<>\"\",$H$8,$G$8)","v":""},{"$f":"IF(OR(C3=\"Janvier\",C3=\"Février\",C3=\"Mars\"),\"Trimestre 1\",IF(OR(C3=\"Avril\",C3=\"Mai\",C3=\"Juin\"),\"Trimestre 2\",IF(OR(C3=\"Juillet\",C3=\"Août\",C3=\"Septembre\"),\"Trimestre 3\",IF(OR(C3=\"Octobre\",C3=\"Novembre\",C3=\"Décembre\"),\"Trimestre 4\",\"\"))))","v":""},{"$f":"IF(OR(Z3=\"Trimestre 1\",Z3=\"Trimestre 2\"),\"Semestre 1\",IF(OR(Z3=\"Trimestre 3\",Z3=\"Trimestre 4\"),\"Semestre 2\",\"\"))","v":""}]
[null,{"$f":"IF(A2<>\"\",A2,\"\")","v":""},{"$f":"IF(B4<>\"\",INDEX([0]!Mois_date,MONTH(B4),1),\"\")","v":""},{"$f":"IF(Num_ligne=0,\"\",INDEX(Bd_num,Num_ligne,1))","v":""},null,null,null,{"$f":"H3","v":""},null,{"$f":"J2","v":""},null,null,{"$f":"IF(L2<>\"\",L2,\"\")","v":""},null,null,{"$f":"IF(O2<>\"\",O2,\"\")","v":""},null,"","","","",null,{"$f":"IF(Accueil!$D$9<>\"\",Accueil!$D$9,\"\")","v":""},{"$f":"IF($E$8<>\"\",$E$8,Strategie)","v":""},{"$f":"IF($H$8<>\"\",$H$8,$G$8)","v":""},{"$f":"IF(OR(C4=\"Janvier\",C4=\"Février\",C4=\"Mars\"),\"Trimestre 1\",IF(OR(C4=\"Avril\",C4=\"Mai\",C4=\"Juin\"),\"Trimestre 2\",IF(OR(C4=\"Juillet\",C4=\"Août\",C4=\"Septembre\"),\"Trimestre 3\",IF(OR(C4=\"Octobre\",C4=\"Novembre\",C4=\"Décembre\"),\"Trimestre 4\",\"\"))))","v":""},{"$f":"IF(OR(Z4=\"Trimestre 1\",Z4=\"Trimestre 2\"),\"Semestre 1\",IF(OR(Z4=\"Trimestre 3\",Z4=\"Trimestre 4\"),\"Semestre 2\",\"\"))","v":""}]
[]
[null,"Modification - suppression des enregistrements"]
[]
[null,"Stratégie",{"$f":"IF(Num_ligne=0,\"\",INDEX(Bd_strat,Num_ligne,1))","v":""},null,null,"Site",{"$f":"IF(Num_ligne=0,\"\",INDEX(Bd_site,Num_ligne,1))","v":""}]
[]
[null,"Date",{"$f":"IF(Num_ligne=0,\"\",INDEX(Bd_date,Num_ligne,1))","v":""},null,null,"Numéro d'ordre"]
[null,null,null,null,null,null,null,null,null,null,null,"Eléments de la PEC",null,"Modification"]
[null,"Caractéristiques du consultant",null,null,"Modification","Classification du cas",null,"Modification",null,null,null,"Bilan","Résultat","Bilan","Résultat"]
[null,"Age",{"$f":"IF(Num_ligne=0,\"\",INDEX(Bd_Age,Num_ligne,1))","v":""},null,null,"Cas",{"$f":"IF(Num_ligne=0,\"\",INDEX(Bd_cas,Num_ligne,1))","v":""},null,null,null,"Bilans \nprescrits",{"$f":"IF(Num_ligne=0,\"\",INDEX(Bd_Bilans,Num_ligne,1))","v":""},{"$f":"IF(Num_ligne=0,\"\",INDEX(Bd_resultat,Num_ligne,1))","v":""}]
[null,null,null,null,null,null,null,null,null,null,null,{"$f":"IF(Num_ligne=0,\"\",INDEX(Bd_Bilans,Num_ligne+1,1))","v":""},{"$f":"IF(Num_ligne=0,\"\",INDEX(Bd_resultat,Num_ligne+1,1))","v":""}]
[null,"Sexe",{"$f":"IF(Num_ligne=0,\"\",INDEX(Bd_Sexe,Num_ligne,1))","v":""},null,null,"Syndrome IST",{"$f":"IF(Num_ligne=0,\"\",INDEX(Bd_SyndIST,Num_ligne,1))","v":""},null,null,null,null,{"$f":"IF(Num_ligne=0,\"\",INDEX(Bd_Bilans,Num_ligne+2,1))","v":""},{"$f":"IF(Num_ligne=0,\"\",INDEX(Bd_resultat,Num_ligne+2,1))","v":""}]
[]
[null,"Bénéficiaire",{"$f":"IF(Num_ligne=0,\"\",INDEX(Bd_benef,Num_ligne,1))","v":""},null,null,"Prise ATB",{"$f":"IF(Num_ligne=0,\"\",INDEX(Bd_ATB,Num_ligne,1))","v":""},null,null,null,null,"Médicament prescrits","Qté en cp/sup/fl","Médicament prescrits","Qté en cp/sup/fl"]
[null,null,null,null,null,null,null,null,null,null,"Traitements prescrits",{"$f":"IF(Num_ligne=0,\"\",INDEX(Bd_ttt,Num_ligne,1))","v":""},{"$f":"IF(Num_ligne=0,\"\",INDEX(Bd_quantite,Num_ligne,1))","v":""}]
[null,"Situation\n matrimoniale",{"$f":"IF(Num_ligne=0,\"\",INDEX(Bd_Sit_matr,Num_ligne,1))","v":""},null,null,null,null,null,null,null,null,{"$f":"IF(Num_ligne=0,\"\",INDEX(Bd_ttt,Num_ligne+1,1))","v":""},{"$f":"IF(Num_ligne=0,\"\",INDEX(Bd_quantite,Num_ligne+1,1))","v":""}]
[null,null,null,null,null,null,null,null,null,null,null,{"$f":"IF(Num_ligne=0,\"\",INDEX(Bd_ttt,Num_ligne+2,1))","v":""},{"$f":"IF(Num_ligne=0,\"\",INDEX(Bd_quantite,Num_ligne+2,1))","v":""}]
[null,null,null,null,null,null,null,null,null,"Observation"]
[null,null,null,null,null,null,null,null,null,null,null,{"$f":"IF(Num_ligne=0,\"\",INDEX(Bd_Observation,Num_ligne,1))","v":""}]

{"sheet":"Nouveau","index":3,"n_rows":21,"n_cols":27,"rows_kept":21,"cut":false,"hidden":true,"merged":[[1,0,3,0],[1,5,3,5],[1,6,3,6],[1,8,3,8],[1,10,3,10],[20,9,20,10],[1,4,3,4],[9,6,9,7],[21,11,24,12],[10,11,10,12],[1,11,3,11],[12,10,14,10],[17,10,19,10],[11,1,11,2],[11,5,11,6],[1,21,3,21],[1,13,3,13],[1,14,3,14],[1,16,3,16]]}
["Date","Date1","Mois","Num ordre","Num consultant","Age","Gr.  Age","Gr.  Age1","Sexe","Sexe1","Sit. Matr","Bénéficiaires","Bénéficiaires1","Cas","Synd. IST","Synd. IST1 ","Prise ATB","Bilans prescrits","Résultats","Traitements","Quantité ","Observations","Section","Stratégie","Site","Trimestre","Semestre"]
[{"$f":"IF(C10<>\"\",C10,\"\")","v":"2009-02-02"},{"$f":"IF(A2<>\"\",A2,\"\")","v":"2009-02-02"},{"$f":"IF(B2<>\"\",INDEX([0]!Mois_date,MONTH(B2),1),\"\")","v":"Février"},{"$f":"MAX(Registre_IST!$D:$D)+1","v":1},{"$f":"Accueil!$D$11&+\"-\"&+$D$2&+\"-\"&+ MID(Accueil!$D$10,1,4)","v":"-1-"},{"$f":"IF(C13<>\"\",C13,\"\")","v":""},{"$f":"IF(F2=\"\",\"\",IF(F2>49,\"50et+\",IF(F2>39,\"40-49\",IF(F2>29,\"30-39\",IF(F2>19,\"20-29\",IF(F2>14,\"15-19\",\"\"))))))","v":""},{"$f":"G2","v":""},{"$f":"C15&\"\"","v":""},{"$f":"I2","v":""},{"$f":"C19&\"\"","v":""},{"$f":"C17&\"\"","v":""},{"$f":"IF(L2<>\"\",L2,\"\")","v":""},{"$f":"G13&\"\"","v":""},{"$f":"G15&\"\"","v":""},{"$f":"IF(O2<>\"\",O2,\"\")","v":""},{"$f":"G17&\"\"","v":""},{"$f":"L13&\"\"","v":""},"",{"$f":"L18&\"\"","v":""},{"$f":"IF(M18<>\"\",M18,\"\")","v":""},{"$f":"L22&\"\"","v":""},{"$f":"IF(Accueil!$D$9<>\"\",Accueil!$D$9,\"\")","v":""},{"$f":"$C$8&\"\"","v":"Mobile"},{"$f":"$G$8&\"\"","v":""},{"$f":"IF(OR(C2=\"Janvier\",C2=\"Février\",C2=\"Mars\"),\"Trimestre 1\",IF(OR(C2=\"Avril\",C2=\"Mai\",C2=\"Juin\"),\"Trimestre 2\",IF(OR(C2=\"Juillet\",C2=\"Août\",C2=\"Septembre\"),\"Trimestre 3\",IF(OR(C2=\"Octobre\",C2=\"Novembre\",C2=\"Décembre\"),\"Trimestre 4\",\"\"))))","v":"Trimestre 1"},{"$f":"IF(OR(Z2=\"Trimestre 1\",Z2=\"Trimestre 2\"),\"Semestre 1\",IF(OR(Z2=\"Trimestre 3\",Z2=\"Trimestre 4\"),\"Semestre 2\",\"\"))","v":"Semestre 1"}]
[null,{"$f":"IF(A2<>\"\",A2,\"\")","v":"2009-02-02"},{"$f":"IF(B3<>\"\",INDEX([0]!Mois_date,MONTH(B3),1),\"\")","v":"Février"},{"$f":"MAX(Registre_IST!$D:$D)+1","v":1},null,null,null,{"$f":"H2","v":""},null,{"$f":"J2","v":""},null,null,{"$f":"IF(L2<>\"\",L2,\"\")","v":""},null,null,{"$f":"IF(O2<>\"\",O2,\"\")","v":""},null,"","",{"$f":"L19&\"\"","v":""},{"$f":"IF(M19<>\"\",M19,\"\")","v":""},null,{"$f":"IF(Accueil!$D$9<>\"\",Accueil!$D$9,\"\")","v":""},{"$f":"$C$8&\"\"","v":"Mobile"},{"$f":"$G$8&\"\"","v":""},{"$f":"IF(OR(C3=\"Janvier\",C3=\"Février\",C3=\"Mars\"),\"Trimestre 1\",IF(OR(C3=\"Avril\",C3=\"Mai\",C3=\"Juin\"),\"Trimestre 2\",IF(OR(C3=\"Juillet\",C3=\"Août\",C3=\"Septembre\"),\"Trimestre 3\",IF(OR(C3=\"Octobre\",C3=\"Novembre\",C3=\"Décembre\"),\"Trimestre 4\",\"\"))))","v":"Trimestre 1"},{"$f":"IF(OR(Z3=\"Trimestre 1\",Z3=\"Trimestre 2\"),\"Semestre 1\",IF(OR(Z3=\"Trimestre 3\",Z3=\"Trimestre 4\"),\"Semestre 2\",\"\"))","v":"Semestre 1"}]
[null,{"$f":"IF(A2<>\"\",A2,\"\")","v":"2009-02-02"},{"$f":"IF(B4<>\"\",INDEX([0]!Mois_date,MONTH(B4),1),\"\")","v":"Février"},{"$f":"MAX(Registre_IST!$D:$D)+1","v":1},null,null,null,{"$f":"H3","v":""},null,{"$f":"J2","v":""},null,null,{"$f":"IF(L2<>\"\",L2,\"\")","v":""},null,null,{"$f":"IF(O2<>\"\",O2,\"\")","v":""},null,"","",{"$f":"L20&\"\"","v":""},{"$f":"IF(M20<>\"\",M20,\"\")","v":""},null,{"$f":"IF(Accueil!$D$9<>\"\",Accueil!$D$9,\"\")","v":""},{"$f":"$C$8&\"\"","v":"Mobile"},{"$f":"$G$8&\"\"","v":""},{"$f":"IF(OR(C4=\"Janvier\",C4=\"Février\",C4=\"Mars\"),\"Trimestre 1\",IF(OR(C4=\"Avril\",C4=\"Mai\",C4=\"Juin\"),\"Trimestre 2\",IF(OR(C4=\"Juillet\",C4=\"Août\",C4=\"Septembre\"),\"Trimestre 3\",IF(OR(C4=\"Octobre\",C4=\"Novembre\",C4=\"Décembre\"),\"Trimestre 4\",\"\"))))","v":"Trimestre 1"},{"$f":"IF(OR(Z4=\"Trimestre 1\",Z4=\"Trimestre 2\"),\"Semestre 1\",IF(OR(Z4=\"Trimestre 3\",Z4=\"Trimestre 4\"),\"Semestre 2\",\"\"))","v":"Semestre 1"}]
[]
[null,"Enregistrement d'un nouveau consultant pour IST"]
[]
[null,"Stratégie","Mobile",null,null,"Site"]
[]
[null,"Date","2009-02-02",null,null,"Numéro d'ordre",{"$f":"$E$2&\"\"","v":"-1-"}]
[null,null,null,null,null,null,null,null,null,null,null,"Eléments de la PEC"]
[null,"Caractéristiques du consultant",null,null,null,"Classification du cas",null,null,null,null,null,"Bilan","Résultat"]
[null,"Age",null,null,null,"Cas",null,null,null,null,"Bilans \nprescrits"]
[]
[null,"Sexe",null,null,null,"Syndrome IST"]
[]
[null,"Bénéficiaire",null,null,null,"Prise ATB",null,null,null,null,null,"Médicament prescrits","Qté en cp/sup/fl"]
[null,null,null,null,null,null,null,null,null,null,"Traitements prescrits"]
[null,"Situation matrimoniale"]
[]
[null,null,null,null,null,null,null,null,null,"Observation"]

{"sheet":"Modif2","index":4,"n_rows":4,"n_cols":27,"rows_kept":4,"cut":false,"hidden":true,"merged":[[1,10,3,10],[1,0,3,0],[1,4,3,4],[1,5,3,5],[1,6,3,6],[1,8,3,8],[1,11,3,11],[1,13,3,13],[1,14,3,14],[1,16,3,16],[1,21,3,21]]}
[]
["2009-02-02","2009-02-02","Février",1,"AGADIR-1-2009",22,"20-29","20-29","M","M","Marié","UDI","UDI","NC","Ecoul. Urétral","Ecoul. Urétral","Oui","","","","","","Agadir","Fixe","Ayada","Trimestre 1","Semestre 1"]
[null,"2009-02-02","Février",1,null,null,null,"20-29",null,"M",null,null,"UDI",null,null,"Ecoul. Urétral",null,"","","","",null,"Agadir","Fixe","Ayada","Trimestre 1","Semestre 1"]
[null,"2009-02-02","Février",1,null,null,null,"20-29",null,"M",null,null,"UDI",null,null,"Ecoul. Urétral",null,"","","","",null,"Agadir","Fixe","Ayada","Trimestre 1","Semestre 1"]

{"sheet":"Valid","index":5,"n_rows":97,"n_cols":13,"rows_kept":97,"cut":false,"hidden":true,"merged":[]}
[null,null,null,null,null,null,null,null,null,null,"Num ligne",null,0]
[null,null,null,null,null,null,null,null,null,null,"Nb_enregistrements",null,{"$f":"COUNTA(Registre_IST!$C:$C)-1","v":0}]
["Ecoul. Urétral",null,null,null,null,null,null,null,null,null,"Nb_lignes",null,{"$f":"Nb_enregistrements+1","v":1}]
["Vaginite"]
["Cervicite",null,null,null,null,null,null,"Semestre 1","Trimestre 1"]
["Douleurs bas ventre",null,null,null,"Fixe",null,null,"Semestre 2","Trimestre 2"]
["Ulcère génital",null,null,null,"Mobile",null,null,null,"Trimestre 3"]
["Autres",null,null,null,null,null,null,null,"Trimestre 4"]
[]
[]
[]
["TPHA-VDRL"]
["Bactério"]
["Echo pelvienne"]
["Test de grossesse"]
[]
[]
["M"]
["F",null,null,null,null,null,null,"Janvier",null,null,{"$f":"MATCH(H19,$H$23:$I$34,0)","v":{"$error":"#N/A"}}]
[]
[]
[]
["Marié",null,null,"Janvier",1,null,null,"Janvier",1,null,null,2]
["Divorcé",null,null,"Février",2,null,null,"Février",1,null,null,3]
["Célibataire",null,null,"Mars",3,null,null,"Mars",1,null,null,4]
["Veuf(ve)",null,null,"Avril",4,null,null,"Avril",2,null,null,5]
["Concubinage",null,null,"Mai",5,null,null,"Mai",2]
[null,null,null,"Juin",6,null,null,"Juin",2]
["UDI",null,null,"Juillet",7,null,null,"Juillet",3]
["PS",null,null,"Août",8,null,null,"Août",3]
["Routiers",null,null,"Septembre",9,null,null,"Septembre",3]
["HSH",null,null,"Octobre",10,null,null,"Octobre",4]
["Ouvriers",null,null,"Novembre",11,null,null,"Novembre",4]
["GP",null,null,"Décembre",12,null,null,"Décembre",4]
["Migrants"]
["Autres"]
["Tous"]
[]
[]
["Benz Péni 1,2"]
["Ceftriaxone"]
["Erythromycine"]
["Doxicycline"]
["Econazol"]
["Métronidazol"]
["Ciprofloxacine"]
["Autre"]
[]
[]
[]
["NC"]
["AC"]
["MC"]
[]
[]
["Oui"]
["Non"]
["Non précisé"]
[]
[]
[]
[]
["Sections",null,"CIDAGs",null,"Siège ALCS",null,null,2008]
["Agadir",null,"AGADIR",null,"Délégation SP",null,null,2009]
["Béni Mellal",null,"AGAMOBILE",null,"MS",null,null,2010]
["Casablanca",null,"AZROU",null,"Autre préciser",null,null,2011]
["El Jadida",null,"INEZGANE",null,null,null,null,2012]
["Essaouira",null,"BMELLAL",null,null,null,null,2013]
["Fes",null,"CASABLANCA2",null,null,null,null,2014]
["Guelmim",null,"CASAMASSIRA",null,null,null,null,2015]
["Laayoune",null,"CASABOUIDANE",null,null,null,null,2016]
["Larache",null,"CASAMOBILE1",null,null,null,null,2017]
["Marrakech",null,"CASAMOBILE2",null,null,null,null,2018]
["Meknes",null,"MOAHMMEDIA",null,null,null,null,2019]
["Nador",null,"JADIDA",null,null,null,null,2020]
["Oujda",null,"ESSAOUIRA",null,null,null,null,2021]
["Rabat",null,"FES",null,null,null,null,2022]
["Safi",null,"GUELMIM",null,null,null,null,2023]
["Tanger",null,"LAAYOUNE",null,null,null,null,2024]
["Taroudant",null,"DAKHLA",null,null,null,null,2025]
["Tétouan",null,"LARACHE",null,null,null,null,2026]
["Tiznit",null,"MARRAKECH",null,null,null,null,2027]
[null,null,"MARAKMOBILE"]
[null,null,"MEKNES"]
[null,null,"NADOR"]
[null,null,"OUJDA"]
[null,null,"RABAT"]
[null,null,"RABAT2"]
[null,null,"SALE"]
[null,null,"SAFI"]
[null,null,"TANGER"]
[null,null,"TANGMOBILE"]
[null,null,"TAROUDANT"]
[null,null,"TANTAN"]
[null,null,"TEMARA"]
[null,null,"TETOUAN"]
[null,null,"TIZNIT"]

{"sheet":"Rap_Mens","index":6,"n_rows":27,"n_cols":11,"rows_kept":27,"cut":false,"hidden":true,"merged":[[10,7,10,8],[10,9,10,10],[1,2,1,3],[2,2,2,3],[3,2,3,3],[10,1,10,2],[10,3,10,4],[10,5,10,6]]}
["Association de Lutte Contre le Sida"]
["Section",null,{"$f":"IF(Accueil!$D$9<>\"\",Accueil!$D$9,\"\")","v":""}]
["Année",null,{"$f":"IF(Accueil!$D$10<>\"\",Accueil!$D$10,\"\")","v":""}]
["CIDAG",null,{"$f":"IF(Accueil!$D$11<>\"\",Accueil!$D$11,\"\")","v":""}]
[]
["Consultation IST"]
[]
["Mois","Février",null,null,null,"Stratégie","Mobile"]
["Bénéficiaires","UDI"]
[]
[null,"15-19",null,"20-29",null,"30-39",null,"40-49",null,"50et+"]
[null,"M","F","M","F","M","F","M","F","M","F"]
["Ecoul. Urétral",{"$f":"IF(AND($B$9<>\"Tous\",$G$8<>\"\"),COUNTIFS(Registre_IST!$C:$C,Rap_Mens!$B$8,Registre_IST!$L:$L,Rap_Mens!$B$9,Registre_IST!$O:$O,Rap_Mens!$A13,Registre_IST!$G:$G,Rap_Mens!$B$11,Registre_IST!$I:$I,Rap_Mens!B$12,Registre_IST!$X:$X,Rap_Mens!$G$8),IF(AND($B$9=\"Tous\",$G$8<>\"\"),COUNTIFS(Registre_IST!$C:$C,Rap_Mens!$B$8,Registre_IST!$O:$O,Rap_Mens!$A13,Registre_IST!$G:$G,Rap_Mens!$B$11,Registre_IST!$I:$I,Rap_Mens!B$12,Registre_IST!$X:$X,Rap_Mens!$G$8),IF(AND($B$9=\"Tous\",$G$8=\"\"),COUNTIFS(Registre_IST!$C:$C,Rap_Mens!$B$8,Registre_IST!$O:$O,Rap_Mens!$A13,Registre_IST!$G:$G,Rap_Mens!$B$11,Registre_IST!$I:$I,Rap_Mens!B$12),IF(AND($B$9<>\"Tous\",$G$8=\"\"),COUNTIFS(Registre_IST!$C:$C,Rap_Mens!$B$8,Registre_IST!$L:$L,Rap_Mens!$B$9,Registre_IST!$O:$O,Rap_Mens!$A13,Registre_IST!$G:$G,Rap_Mens!$B$11,Registre_IST!$I:$I,Rap_Mens!B$12)))))","v":0},{"$f":"IF(AND($B$9<>\"Tous\",$G$8<>\"\"),COUNTIFS(Registre_IST!$C:$C,Rap_Mens!$B$8,Registre_IST!$L:$L,Rap_Mens!$B$9,Registre_IST!$O:$O,Rap_Mens!$A13,Registre_IST!$G:$G,Rap_Mens!$B$11,Registre_IST!$I:$I,Rap_Mens!C$12,Registre_IST!$X:$X,Rap_Mens!$G$8),IF(AND($B$9=\"Tous\",$G$8<>\"\"),COUNTIFS(Registre_IST!$C:$C,Rap_Mens!$B$8,Registre_IST!$O:$O,Rap_Mens!$A13,Registre_IST!$G:$G,Rap_Mens!$B$11,Registre_IST!$I:$I,Rap_Mens!C$12,Registre_IST!$X:$X,Rap_Mens!$G$8),IF(AND($B$9=\"Tous\",$G$8=\"\"),COUNTIFS(Registre_IST!$C:$C,Rap_Mens!$B$8,Registre_IST!$O:$O,Rap_Mens!$A13,Registre_IST!$G:$G,Rap_Mens!$B$11,Registre_IST!$I:$I,Rap_Mens!C$12),IF(AND($B$9<>\"Tous\",$G$8=\"\"),COUNTIFS(Registre_IST!$C:$C,Rap_Mens!$B$8,Registre_IST!$L:$L,Rap_Mens!$B$9,Registre_IST!$O:$O,Rap_Mens!$A13,Registre_IST!$G:$G,Rap_Mens!$B$11,Registre_IST!$I:$I,Rap_Mens!C$12)))))","v":0},{"$f":"IF(AND($B$9<>\"Tous\",$G$8<>\"\"),COUNTIFS(Registre_IST!$C:$C,Rap_Mens!$B$8,Registre_IST!$L:$L,Rap_Mens!$B$9,Registre_IST!$O:$O,Rap_Mens!$A13,Registre_IST!$G:$G,Rap_Mens!$D$11,Registre_IST!$I:$I,Rap_Mens!D$12,Registre_IST!$X:$X,Rap_Mens!$G$8),IF(AND($B$9=\"Tous\",$G$8<>\"\"),COUNTIFS(Registre_IST!$C:$C,Rap_Mens!$B$8,Registre_IST!$O:$O,Rap_Mens!$A13,Registre_IST!$G:$G,Rap_Mens!$D$11,Registre_IST!$I:$I,Rap_Mens!D$12,Registre_IST!$X:$X,Rap_Mens!$G$8),IF(AND($B$9=\"Tous\",$G$8=\"\"),COUNTIFS(Registre_IST!$C:$C,Rap_Mens!$B$8,Registre_IST!$O:$O,Rap_Mens!$A13,Registre_IST!$G:$G,Rap_Mens!$D$11,Registre_IST!$I:$I,Rap_Mens!D$12),IF(AND($B$9<>\"Tous\",$G$8=\"\"),COUNTIFS(Registre_IST!$C:$C,Rap_Mens!$B$8,Registre_IST!$L:$L,Rap_Mens!$B$9,Registre_IST!$O:$O,Rap_Mens!$A13,Registre_IST!$G:$G,Rap_Mens!$D$11,Registre_IST!$I:$I,Rap_Mens!D$12)))))","v":0},{"$f":"IF(AND($B$9<>\"Tous\",$G$8<>\"\"),COUNTIFS(Registre_IST!$C:$C,Rap_Mens!$B$8,Registre_IST!$L:$L,Rap_Mens!$B$9,Registre_IST!$O:$O,Rap_Mens!$A13,Registre_IST!$G:$G,Rap_Mens!$D$11,Registre_IST!$I:$I,Rap_Mens!E$12,Registre_IST!$X:$X,Rap_Mens!$G$8),IF(AND($B$9=\"Tous\",$G$8<>\"\"),COUNTIFS(Registre_IST!$C:$C,Rap_Mens!$B$8,Registre_IST!$O:$O,Rap_Mens!$A13,Registre_IST!$G:$G,Rap_Mens!$D$11,Registre_IST!$I:$I,Rap_Mens!E$12,Registre_IST!$X:$X,Rap_Mens!$G$8),IF(AND($B$9=\"Tous\",$G$8=\"\"),COUNTIFS(Registre_IST!$C:$C,Rap_Mens!$B$8,Registre_IST!$O:$O,Rap_Mens!$A13,Registre_IST!$G:$G,Rap_Mens!$D$11,Registre_IST!$I:$I,Rap_Mens!E$12),IF(AND($B$9<>\"Tous\",$G$8=\"\"),COUNTIFS(Registre_IST!$C:$C,Rap_Mens!$B$8,Registre_IST!$L:$L,Rap_Mens!$B$9,Registre_IST!$O:$O,Rap_Mens!$A13,Registre_IST!$G:$G,Rap_Mens!$D$11,Registre_IST!$I:$I,Rap_Mens!E$12)))))","v":0},{"$f":"IF(AND($B$9<>\"Tous\",$G$8<>\"\"),COUNTIFS(Registre_IST!$C:$C,Rap_Mens!$B$8,Registre_IST!$L:$L,Rap_Mens!$B$9,Registre_IST!$O:$O,Rap_Mens!$A13,Registre_IST!$G:$G,Rap_Mens!$F$11,Registre_IST!$I:$I,Rap_Mens!F$12,Registre_IST!$X:$X,Rap_Mens!$G$8),IF(AND($B$9=\"Tous\",$G$8<>\"\"),COUNTIFS(Registre_IST!$C:$C,Rap_Mens!$B$8,Registre_IST!$O:$O,Rap_Mens!$A13,Registre_IST!$G:$G,Rap_Mens!$F$11,Registre_IST!$I:$I,Rap_Mens!F$12,Registre_IST!$X:$X,Rap_Mens!$G$8),IF(AND($B$9=\"Tous\",$G$8=\"\"),COUNTIFS(Registre_IST!$C:$C,Rap_Mens!$B$8,Registre_IST!$O:$O,Rap_Mens!$A13,Registre_IST!$G:$G,Rap_Mens!$F$11,Registre_IST!$I:$I,Rap_Mens!F$12),IF(AND($B$9<>\"Tous\",$G$8=\"\"),COUNTIFS(Registre_IST!$C:$C,Rap_Mens!$B$8,Registre_IST!$L:$L,Rap_Mens!$B$9,Registre_IST!$O:$O,Rap_Mens!$A13,Registre_IST!$G:$G,Rap_Mens!$F$11,Registre_IST!$I:$I,Rap_Mens!F$12)))))","v":0},{"$f":"IF(AND($B$9<>\"Tous\",$G$8<>\"\"),COUNTIFS(Registre_IST!$C:$C,Rap_Mens!$B$8,Registre_IST!$L:$L,Rap_Mens!$B$9,Registre_IST!$O:$O,Rap_Mens!$A13,Registre_IST!$G:$G,Rap_Mens!$F$11,Registre_IST!$I:$I,Rap_Mens!G$12,Registre_IST!$X:$X,Rap_Mens!$G$8),IF(AND($B$9=\"Tous\",$G$8<>\"\"),COUNTIFS(Registre_IST!$C:$C,Rap_Mens!$B$8,Registre_IST!$O:$O,Rap_Mens!$A13,Registre_IST!$G:$G,Rap_Mens!$F$11,Registre_IST!$I:$I,Rap_Mens!G$12,Registre_IST!$X:$X,Rap_Mens!$G$8),IF(AND($B$9=\"Tous\",$G$8=\"\"),COUNTIFS(Registre_IST!$C:$C,Rap_Mens!$B$8,Registre_IST!$O:$O,Rap_Mens!$A13,Registre_IST!$G:$G,Rap_Mens!$F$11,Registre_IST!$I:$I,Rap_Mens!G$12),IF(AND($B$9<>\"Tous\",$G$8=\"\"),COUNTIFS(Registre_IST!$C:$C,Rap_Mens!$B$8,Registre_IST!$L:$L,Rap_Mens!$B$9,Registre_IST!$O:$O,Rap_Mens!$A13,Registre_IST!$G:$G,Rap_Mens!$F$11,Registre_IST!$I:$I,Rap_Mens!G$12)))))","v":0},{"$f":"IF(AND($B$9<>\"Tous\",$G$8<>\"\"),COUNTIFS(Registre_IST!$C:$C,Rap_Mens!$B$8,Registre_IST!$L:$L,Rap_Mens!$B$9,Registre_IST!$O:$O,Rap_Mens!$A13,Registre_IST!$G:$G,Rap_Mens!$H$11,Registre_IST!$I:$I,Rap_Mens!H$12,Registre_IST!$X:$X,Rap_Mens!$G$8),IF(AND($B$9=\"Tous\",$G$8<>\"\"),COUNTIFS(Registre_IST!$C:$C,Rap_Mens!$B$8,Registre_IST!$O:$O,Rap_Mens!$A13,Registre_IST!$G:$G,Rap_Mens!$H$11,Registre_IST!$I:$I,Rap_Mens!H$12,Registre_IST!$X:$X,Rap_Mens!$G$8),IF(AND($B$9=\"Tous\",$G$8=\"\"),COUNTIFS(Registre_IST!$C:$C,Rap_Mens!$B$8,Registre_IST!$O:$O,Rap_Mens!$A13,Registre_IST!$G:$G,Rap_Mens!$H$11,Registre_IST!$I:$I,Rap_Mens!H$12),IF(AND($B$9<>\"Tous\",$G$8=\"\"),COUNTIFS(Registre_IST!$C:$C,Rap_Mens!$B$8,Registre_IST!$L:$L,Rap_Mens!$B$9,Registre_IST!$O:$O,Rap_Mens!$A13,Registre_IST!$G:$G,Rap_Mens!$H$11,Registre_IST!$I:$I,Rap_Mens!H$12)))))","v":0},{"$f":"IF(AND($B$9<>\"Tous\",$G$8<>\"\"),COUNTIFS(Registre_IST!$C:$C,Rap_Mens!$B$8,Registre_IST!$L:$L,Rap_Mens!$B$9,Registre_IST!$O:$O,Rap_Mens!$A13,Registre_IST!$G:$G,Rap_Mens!$H$11,Registre_IST!$I:$I,Rap_Mens!I$12,Registre_IST!$X:$X,Rap_Mens!$G$8),IF(AND($B$9=\"Tous\",$G$8<>\"\"),COUNTIFS(Registre_IST!$C:$C,Rap_Mens!$B$8,Registre_IST!$O:$O,Rap_Mens!$A13,Registre_IST!$G:$G,Rap_Mens!$H$11,Registre_IST!$I:$I,Rap_Mens!I$12,Registre_IST!$X:$X,Rap_Mens!$G$8),IF(AND($B$9=\"Tous\",$G$8=\"\"),COUNTIFS(Registre_IST!$C:$C,Rap_Mens!$B$8,Registre_IST!$O:$O,Rap_Mens!$A13,Registre_IST!$G:$G,Rap_Mens!$H$11,Registre_IST!$I:$I,Rap_Mens!I$12),IF(AND($B$9<>\"Tous\",$G$8=\"\"),COUNTIFS(Registre_IST!$C:$C,Rap_Mens!$B$8,Registre_IST!$L:$L,Rap_Mens!$B$9,Registre_IST!$O:$O,Rap_Mens!$A13,Registre_IST!$G:$G,Rap_Mens!$H$11,Registre_IST!$I:$I,Rap_Mens!I$12)))))","v":0},{"$f":"IF(AND($B$9<>\"Tous\",$G$8<>\"\"),COUNTIFS(Registre_IST!$C:$C,Rap_Mens!$B$8,Registre_IST!$L:$L,Rap_Mens!$B$9,Registre_IST!$O:$O,Rap_Mens!$A13,Registre_IST!$G:$G,Rap_Mens!$J$11,Registre_IST!$I:$I,Rap_Mens!J$12,Registre_IST!$X:$X,Rap_Mens!$G$8),IF(AND($B$9=\"Tous\",$G$8<>\"\"),COUNTIFS(Registre_IST!$C:$C,Rap_Mens!$B$8,Registre_IST!$O:$O,Rap_Mens!$A13,Registre_IST!$G:$G,Rap_Mens!$J$11,Registre_IST!$I:$I,Rap_Mens!J$12,Registre_IST!$X:$X,Rap_Mens!$G$8),IF(AND($B$9=\"Tous\",$G$8=\"\"),COUNTIFS(Registre_IST!$C:$C,Rap_Mens!$B$8,Registre_IST!$O:$O,Rap_Mens!$A13,Registre_IST!$G:$G,Rap_Mens!$J$11,Registre_IST!$I:$I,Rap_Mens!J$12),IF(AND($B$9<>\"Tous\",$G$8=\"\"),COUNTIFS(Registre_IST!$C:$C,Rap_Mens!$B$8,Registre_IST!$L:$L,Rap_Mens!$B$9,Registre_IST!$O:$O,Rap_Mens!$A13,Registre_IST!$G:$G,Rap_Mens!$J$11,Registre_IST!$I:$I,Rap_Mens!J$12)))))","v":0},{"$f":"IF(AND($B$9<>\"Tous\",$G$8<>\"\"),COUNTIFS(Registre_IST!$C:$C,Rap_Mens!$B$8,Registre_IST!$L:$L,Rap_Mens!$B$9,Registre_IST!$O:$O,Rap_Mens!$A13,Registre_IST!$G:$G,Rap_Mens!$J$11,Registre_IST!$I:$I,Rap_Mens!K$12,Registre_IST!$X:$X,Rap_Mens!$G$8),IF(AND($B$9=\"Tous\",$G$8<>\"\"),COUNTIFS(Registre_IST!$C:$C,Rap_Mens!$B$8,Registre_IST!$O:$O,Rap_Mens!$A13,Registre_IST!$G:$G,Rap_Mens!$J$11,Registre_IST!$I:$I,Rap_Mens!K$12,Registre_IST!$X:$X,Rap_Mens!$G$8),IF(AND($B$9=\"Tous\",$G$8=\"\"),COUNTIFS(Registre_IST!$C:$C,Rap_Mens!$B$8,Registre_IST!$O:$O,Rap_Mens!$A13,Registre_IST!$G:$G,Rap_Mens!$J$11,Registre_IST!$I:$I,Rap_Mens!K$12),IF(AND($B$9<>\"Tous\",$G$8=\"\"),COUNTIFS(Registre_IST!$C:$C,Rap_Mens!$B$8,Registre_IST!$L:$L,Rap_Mens!$B$9,Registre_IST!$O:$O,Rap_Mens!$A13,Registre_IST!$G:$G,Rap_Mens!$J$11,Registre_IST!$I:$I,Rap_Mens!K$12)))))","v":0}]
["Vaginite",{"$f":"IF(AND($B$9<>\"Tous\",$G$8<>\"\"),COUNTIFS(Registre_IST!$C:$C,Rap_Mens!$B$8,Registre_IST!$L:$L,Rap_Mens!$B$9,Registre_IST!$O:$O,Rap_Mens!$A14,Registre_IST!$G:$G,Rap_Mens!$B$11,Registre_IST!$I:$I,Rap_Mens!B$12,Registre_IST!$X:$X,Rap_Mens!$G$8),IF(AND($B$9=\"Tous\",$G$8<>\"\"),COUNTIFS(Registre_IST!$C:$C,Rap_Mens!$B$8,Registre_IST!$O:$O,Rap_Mens!$A14,Registre_IST!$G:$G,Rap_Mens!$B$11,Registre_IST!$I:$I,Rap_Mens!B$12,Registre_IST!$X:$X,Rap_Mens!$G$8),IF(AND($B$9=\"Tous\",$G$8=\"\"),COUNTIFS(Registre_IST!$C:$C,Rap_Mens!$B$8,Registre_IST!$O:$O,Rap_Mens!$A14,Registre_IST!$G:$G,Rap_Mens!$B$11,Registre_IST!$I:$I,Rap_Mens!B$12),IF(AND($B$9<>\"Tous\",$G$8=\"\"),COUNTIFS(Registre_IST!$C:$C,Rap_Mens!$B$8,Registre_IST!$L:$L,Rap_Mens!$B$9,Registre_IST!$O:$O,Rap_Mens!$A14,Registre_IST!$G:$G,Rap_Mens!$B$11,Registre_IST!$I:$I,Rap_Mens!B$12)))))","v":0},{"$f":"IF(AND($B$9<>\"Tous\",$G$8<>\"\"),COUNTIFS(Registre_IST!$C:$C,Rap_Mens!$B$8,Registre_IST!$L:$L,Rap_Mens!$B$9,Registre_IST!$O:$O,Rap_Mens!$A14,Registre_IST!$G:$G,Rap_Mens!$B$11,Registre_IST!$I:$I,Rap_Mens!C$12,Registre_IST!$X:$X,Rap_Mens!$G$8),IF(AND($B$9=\"Tous\",$G$8<>\"\"),COUNTIFS(Registre_IST!$C:$C,Rap_Mens!$B$8,Registre_IST!$O:$O,Rap_Mens!$A14,Registre_IST!$G:$G,Rap_Mens!$B$11,Registre_IST!$I:$I,Rap_Mens!C$12,Registre_IST!$X:$X,Rap_Mens!$G$8),IF(AND($B$9=\"Tous\",$G$8=\"\"),COUNTIFS(Registre_IST!$C:$C,Rap_Mens!$B$8,Registre_IST!$O:$O,Rap_Mens!$A14,Registre_IST!$G:$G,Rap_Mens!$B$11,Registre_IST!$I:$I,Rap_Mens!C$12),IF(AND($B$9<>\"Tous\",$G$8=\"\"),COUNTIFS(Registre_IST!$C:$C,Rap_Mens!$B$8,Registre_IST!$L:$L,Rap_Mens!$B$9,Registre_IST!$O:$O,Rap_Mens!$A14,Registre_IST!$G:$G,Rap_Mens!$B$11,Registre_IST!$I:$I,Rap_Mens!C$12)))))","v":0},{"$f":"IF(AND($B$9<>\"Tous\",$G$8<>\"\"),COUNTIFS(Registre_IST!$C:$C,Rap_Mens!$B$8,Registre_IST!$L:$L,Rap_Mens!$B$9,Registre_IST!$O:$O,Rap_Mens!$A14,Registre_IST!$G:$G,Rap_Mens!$D$11,Registre_IST!$I:$I,Rap_Mens!D$12,Registre_IST!$X:$X,Rap_Mens!$G$8),IF(AND($B$9=\"Tous\",$G$8<>\"\"),COUNTIFS(Registre_IST!$C:$C,Rap_Mens!$B$8,Registre_IST!$O:$O,Rap_Mens!$A14,Registre_IST!$G:$G,Rap_Mens!$D$11,Registre_IST!$I:$I,Rap_Mens!D$12,Registre_IST!$X:$X,Rap_Mens!$G$8),IF(AND($B$9=\"Tous\",$G$8=\"\"),COUNTIFS(Registre_IST!$C:$C,Rap_Mens!$B$8,Registre_IST!$O:$O,Rap_Mens!$A14,Registre_IST!$G:$G,Rap_Mens!$D$11,Registre_IST!$I:$I,Rap_Mens!D$12),IF(AND($B$9<>\"Tous\",$G$8=\"\"),COUNTIFS(Registre_IST!$C:$C,Rap_Mens!$B$8,Registre_IST!$L:$L,Rap_Mens!$B$9,Registre_IST!$O:$O,Rap_Mens!$A14,Registre_IST!$G:$G,Rap_Mens!$D$11,Registre_IST!$I:$I,Rap_Mens!D$12)))))","v":0},{"$f":"IF(AND($B$9<>\"Tous\",$G$8<>\"\"),COUNTIFS(Registre_IST!$C:$C,Rap_Mens!$B$8,Registre_IST!$L:$L,Rap_Mens!$B$9,Registre_IST!$O:$O,Rap_Mens!$A14,Registre_IST!$G:$G,Rap_Mens!$D$11,Registre_IST!$I:$I,Rap_Mens!E$12,Registre_IST!$X:$X,Rap_Mens!$G$8),IF(AND($B$9=\"Tous\",$G$8<>\"\"),COUNTIFS(Registre_IST!$C:$C,Rap_Mens!$B$8,Registre_IST!$O:$O,Rap_Mens!$A14,Registre_IST!$G:$G,Rap_Mens!$D$11,Registre_IST!$I:$I,Rap_Mens!E$12,Registre_IST!$X:$X,Rap_Mens!$G$8),IF(AND($B$9=\"Tous\",$G$8=\"\"),COUNTIFS(Registre_IST!$C:$C,Rap_Mens!$B$8,Registre_IST!$O:$O,Rap_Mens!$A14,Registre_IST!$G:$G,Rap_Mens!$D$11,Registre_IST!$I:$I,Rap_Mens!E$12),IF(AND($B$9<>\"Tous\",$G$8=\"\"),COUNTIFS(Registre_IST!$C:$C,Rap_Mens!$B$8,Registre_IST!$L:$L,Rap_Mens!$B$9,Registre_IST!$O:$O,Rap_Mens!$A14,Registre_IST!$G:$G,Rap_Mens!$D$11,Registre_IST!$I:$I,Rap_Mens!E$12)))))","v":0},{"$f":"IF(AND($B$9<>\"Tous\",$G$8<>\"\"),COUNTIFS(Registre_IST!$C:$C,Rap_Mens!$B$8,Registre_IST!$L:$L,Rap_Mens!$B$9,Registre_IST!$O:$O,Rap_Mens!$A14,Registre_IST!$G:$G,Rap_Mens!$F$11,Registre_IST!$I:$I,Rap_Mens!F$12,Registre_IST!$X:$X,Rap_Mens!$G$8),IF(AND($B$9=\"Tous\",$G$8<>\"\"),COUNTIFS(Registre_IST!$C:$C,Rap_Mens!$B$8,Registre_IST!$O:$O,Rap_Mens!$A14,Registre_IST!$G:$G,Rap_Mens!$F$11,Registre_IST!$I:$I,Rap_Mens!F$12,Registre_IST!$X:$X,Rap_Mens!$G$8),IF(AND($B$9=\"Tous\",$G$8=\"\"),COUNTIFS(Registre_IST!$C:$C,Rap_Mens!$B$8,Registre_IST!$O:$O,Rap_Mens!$A14,Registre_IST!$G:$G,Rap_Mens!$F$11,Registre_IST!$I:$I,Rap_Mens!F$12),IF(AND($B$9<>\"Tous\",$G$8=\"\"),COUNTIFS(Registre_IST!$C:$C,Rap_Mens!$B$8,Registre_IST!$L:$L,Rap_Mens!$B$9,Registre_IST!$O:$O,Rap_Mens!$A14,Registre_IST!$G:$G,Rap_Mens!$F$11,Registre_IST!$I:$I,Rap_Mens!F$12)))))","v":0},{"$f":"IF(AND($B$9<>\"Tous\",$G$8<>\"\"),COUNTIFS(Registre_IST!$C:$C,Rap_Mens!$B$8,Registre_IST!$L:$L,Rap_Mens!$B$9,Registre_IST!$O:$O,Rap_Mens!$A14,Registre_IST!$G:$G,Rap_Mens!$F$11,Registre_IST!$I:$I,Rap_Mens!G$12,Registre_IST!$X:$X,Rap_Mens!$G$8),IF(AND($B$9=\"Tous\",$G$8<>\"\"),COUNTIFS(Registre_IST!$C:$C,Rap_Mens!$B$8,Registre_IST!$O:$O,Rap_Mens!$A14,Registre_IST!$G:$G,Rap_Mens!$F$11,Registre_IST!$I:$I,Rap_Mens!G$12,Registre_IST!$X:$X,Rap_Mens!$G$8),IF(AND($B$9=\"Tous\",$G$8=\"\"),COUNTIFS(Registre_IST!$C:$C,Rap_Mens!$B$8,Registre_IST!$O:$O,Rap_Mens!$A14,Registre_IST!$G:$G,Rap_Mens!$F$11,Registre_IST!$I:$I,Rap_Mens!G$12),IF(AND($B$9<>\"Tous\",$G$8=\"\"),COUNTIFS(Registre_IST!$C:$C,Rap_Mens!$B$8,Registre_IST!$L:$L,Rap_Mens!$B$9,Registre_IST!$O:$O,Rap_Mens!$A14,Registre_IST!$G:$G,Rap_Mens!$F$11,Registre_IST!$I:$I,Rap_Mens!G$12)))))","v":0},{"$f":"IF(AND($B$9<>\"Tous\",$G$8<>\"\"),COUNTIFS(Registre_IST!$C:$C,Rap_Mens!$B$8,Registre_IST!$L:$L,Rap_Mens!$B$9,Registre_IST!$O:$O,Rap_Mens!$A14,Registre_IST!$G:$G,Rap_Mens!$H$11,Registre_IST!$I:$I,Rap_Mens!H$12,Registre_IST!$X:$X,Rap_Mens!$G$8),IF(AND($B$9=\"Tous\",$G$8<>\"\"),COUNTIFS(Registre_IST!$C:$C,Rap_Mens!$B$8,Registre_IST!$O:$O,Rap_Mens!$A14,Registre_IST!$G:$G,Rap_Mens!$H$11,Registre_IST!$I:$I,Rap_Mens!H$12,Registre_IST!$X:$X,Rap_Mens!$G$8),IF(AND($B$9=\"Tous\",$G$8=\"\"),COUNTIFS(Registre_IST!$C:$C,Rap_Mens!$B$8,Registre_IST!$O:$O,Rap_Mens!$A14,Registre_IST!$G:$G,Rap_Mens!$H$11,Registre_IST!$I:$I,Rap_Mens!H$12),IF(AND($B$9<>\"Tous\",$G$8=\"\"),COUNTIFS(Registre_IST!$C:$C,Rap_Mens!$B$8,Registre_IST!$L:$L,Rap_Mens!$B$9,Registre_IST!$O:$O,Rap_Mens!$A14,Registre_IST!$G:$G,Rap_Mens!$H$11,Registre_IST!$I:$I,Rap_Mens!H$12)))))","v":0},{"$f":"IF(AND($B$9<>\"Tous\",$G$8<>\"\"),COUNTIFS(Registre_IST!$C:$C,Rap_Mens!$B$8,Registre_IST!$L:$L,Rap_Mens!$B$9,Registre_IST!$O:$O,Rap_Mens!$A14,Registre_IST!$G:$G,Rap_Mens!$H$11,Registre_IST!$I:$I,Rap_Mens!I$12,Registre_IST!$X:$X,Rap_Mens!$G$8),IF(AND($B$9=\"Tous\",$G$8<>\"\"),COUNTIFS(Registre_IST!$C:$C,Rap_Mens!$B$8,Registre_IST!$O:$O,Rap_Mens!$A14,Registre_IST!$G:$G,Rap_Mens!$H$11,Registre_IST!$I:$I,Rap_Mens!I$12,Registre_IST!$X:$X,Rap_Mens!$G$8),IF(AND($B$9=\"Tous\",$G$8=\"\"),COUNTIFS(Registre_IST!$C:$C,Rap_Mens!$B$8,Registre_IST!$O:$O,Rap_Mens!$A14,Registre_IST!$G:$G,Rap_Mens!$H$11,Registre_IST!$I:$I,Rap_Mens!I$12),IF(AND($B$9<>\"Tous\",$G$8=\"\"),COUNTIFS(Registre_IST!$C:$C,Rap_Mens!$B$8,Registre_IST!$L:$L,Rap_Mens!$B$9,Registre_IST!$O:$O,Rap_Mens!$A14,Registre_IST!$G:$G,Rap_Mens!$H$11,Registre_IST!$I:$I,Rap_Mens!I$12)))))","v":0},{"$f":"IF(AND($B$9<>\"Tous\",$G$8<>\"\"),COUNTIFS(Registre_IST!$C:$C,Rap_Mens!$B$8,Registre_IST!$L:$L,Rap_Mens!$B$9,Registre_IST!$O:$O,Rap_Mens!$A14,Registre_IST!$G:$G,Rap_Mens!$J$11,Registre_IST!$I:$I,Rap_Mens!J$12,Registre_IST!$X:$X,Rap_Mens!$G$8),IF(AND($B$9=\"Tous\",$G$8<>\"\"),COUNTIFS(Registre_IST!$C:$C,Rap_Mens!$B$8,Registre_IST!$O:$O,Rap_Mens!$A14,Registre_IST!$G:$G,Rap_Mens!$J$11,Registre_IST!$I:$I,Rap_Mens!J$12,Registre_IST!$X:$X,Rap_Mens!$G$8),IF(AND($B$9=\"Tous\",$G$8=\"\"),COUNTIFS(Registre_IST!$C:$C,Rap_Mens!$B$8,Registre_IST!$O:$O,Rap_Mens!$A14,Registre_IST!$G:$G,Rap_Mens!$J$11,Registre_IST!$I:$I,Rap_Mens!J$12),IF(AND($B$9<>\"Tous\",$G$8=\"\"),COUNTIFS(Registre_IST!$C:$C,Rap_Mens!$B$8,Registre_IST!$L:$L,Rap_Mens!$B$9,Registre_IST!$O:$O,Rap_Mens!$A14,Registre_IST!$G:$G,Rap_Mens!$J$11,Registre_IST!$I:$I,Rap_Mens!J$12)))))","v":0},{"$f":"IF(AND($B$9<>\"Tous\",$G$8<>\"\"),COUNTIFS(Registre_IST!$C:$C,Rap_Mens!$B$8,Registre_IST!$L:$L,Rap_Mens!$B$9,Registre_IST!$O:$O,Rap_Mens!$A14,Registre_IST!$G:$G,Rap_Mens!$J$11,Registre_IST!$I:$I,Rap_Mens!K$12,Registre_IST!$X:$X,Rap_Mens!$G$8),IF(AND($B$9=\"Tous\",$G$8<>\"\"),COUNTIFS(Registre_IST!$C:$C,Rap_Mens!$B$8,Registre_IST!$O:$O,Rap_Mens!$A14,Registre_IST!$G:$G,Rap_Mens!$J$11,Registre_IST!$I:$I,Rap_Mens!K$12,Registre_IST!$X:$X,Rap_Mens!$G$8),IF(AND($B$9=\"Tous\",$G$8=\"\"),COUNTIFS(Registre_IST!$C:$C,Rap_Mens!$B$8,Registre_IST!$O:$O,Rap_Mens!$A14,Registre_IST!$G:$G,Rap_Mens!$J$11,Registre_IST!$I:$I,Rap_Mens!K$12),IF(AND($B$9<>\"Tous\",$G$8=\"\"),COUNTIFS(Registre_IST!$C:$C,Rap_Mens!$B$8,Registre_IST!$L:$L,Rap_Mens!$B$9,Registre_IST!$O:$O,Rap_Mens!$A14,Registre_IST!$G:$G,Rap_Mens!$J$11,Registre_IST!$I:$I,Rap_Mens!K$12)))))","v":0}]
["Cervicite",{"$f":"IF(AND($B$9<>\"Tous\",$G$8<>\"\"),COUNTIFS(Registre_IST!$C:$C,Rap_Mens!$B$8,Registre_IST!$L:$L,Rap_Mens!$B$9,Registre_IST!$O:$O,Rap_Mens!$A15,Registre_IST!$G:$G,Rap_Mens!$B$11,Registre_IST!$I:$I,Rap_Mens!B$12,Registre_IST!$X:$X,Rap_Mens!$G$8),IF(AND($B$9=\"Tous\",$G$8<>\"\"),COUNTIFS(Registre_IST!$C:$C,Rap_Mens!$B$8,Registre_IST!$O:$O,Rap_Mens!$A15,Registre_IST!$G:$G,Rap_Mens!$B$11,Registre_IST!$I:$I,Rap_Mens!B$12,Registre_IST!$X:$X,Rap_Mens!$G$8),IF(AND($B$9=\"Tous\",$G$8=\"\"),COUNTIFS(Registre_IST!$C:$C,Rap_Mens!$B$8,Registre_IST!$O:$O,Rap_Mens!$A15,Registre_IST!$G:$G,Rap_Mens!$B$11,Registre_IST!$I:$I,Rap_Mens!B$12),IF(AND($B$9<>\"Tous\",$G$8=\"\"),COUNTIFS(Registre_IST!$C:$C,Rap_Mens!$B$8,Registre_IST!$L:$L,Rap_Mens!$B$9,Registre_IST!$O:$O,Rap_Mens!$A15,Registre_IST!$G:$G,Rap_Mens!$B$11,Registre_IST!$I:$I,Rap_Mens!B$12)))))","v":0},{"$f":"IF(AND($B$9<>\"Tous\",$G$8<>\"\"),COUNTIFS(Registre_IST!$C:$C,Rap_Mens!$B$8,Registre_IST!$L:$L,Rap_Mens!$B$9,Registre_IST!$O:$O,Rap_Mens!$A15,Registre_IST!$G:$G,Rap_Mens!$B$11,Registre_IST!$I:$I,Rap_Mens!C$12,Registre_IST!$X:$X,Rap_Mens!$G$8),IF(AND($B$9=\"Tous\",$G$8<>\"\"),COUNTIFS(Registre_IST!$C:$C,Rap_Mens!$B$8,Registre_IST!$O:$O,Rap_Mens!$A15,Registre_IST!$G:$G,Rap_Mens!$B$11,Registre_IST!$I:$I,Rap_Mens!C$12,Registre_IST!$X:$X,Rap_Mens!$G$8),IF(AND($B$9=\"Tous\",$G$8=\"\"),COUNTIFS(Registre_IST!$C:$C,Rap_Mens!$B$8,Registre_IST!$O:$O,Rap_Mens!$A15,Registre_IST!$G:$G,Rap_Mens!$B$11,Registre_IST!$I:$I,Rap_Mens!C$12),IF(AND($B$9<>\"Tous\",$G$8=\"\"),COUNTIFS(Registre_IST!$C:$C,Rap_Mens!$B$8,Registre_IST!$L:$L,Rap_Mens!$B$9,Registre_IST!$O:$O,Rap_Mens!$A15,Registre_IST!$G:$G,Rap_Mens!$B$11,Registre_IST!$I:$I,Rap_Mens!C$12)))))","v":0},{"$f":"IF(AND($B$9<>\"Tous\",$G$8<>\"\"),COUNTIFS(Registre_IST!$C:$C,Rap_Mens!$B$8,Registre_IST!$L:$L,Rap_Mens!$B$9,Registre_IST!$O:$O,Rap_Mens!$A15,Registre_IST!$G:$G,Rap_Mens!$D$11,Registre_IST!$I:$I,Rap_Mens!D$12,Registre_IST!$X:$X,Rap_Mens!$G$8),IF(AND($B$9=\"Tous\",$G$8<>\"\"),COUNTIFS(Registre_IST!$C:$C,Rap_Mens!$B$8,Registre_IST!$O:$O,Rap_Mens!$A15,Registre_IST!$G:$G,Rap_Mens!$D$11,Registre_IST!$I:$I,Rap_Mens!D$12,Registre_IST!$X:$X,Rap_Mens!$G$8),IF(AND($B$9=\"Tous\",$G$8=\"\"),COUNTIFS(Registre_IST!$C:$C,Rap_Mens!$B$8,Registre_IST!$O:$O,Rap_Mens!$A15,Registre_IST!$G:$G,Rap_Mens!$D$11,Registre_IST!$I:$I,Rap_Mens!D$12),IF(AND($B$9<>\"Tous\",$G$8=\"\"),COUNTIFS(Registre_IST!$C:$C,Rap_Mens!$B$8,Registre_IST!$L:$L,Rap_Mens!$B$9,Registre_IST!$O:$O,Rap_Mens!$A15,Registre_IST!$G:$G,Rap_Mens!$D$11,Registre_IST!$I:$I,Rap_Mens!D$12)))))","v":0},{"$f":"IF(AND($B$9<>\"Tous\",$G$8<>\"\"),COUNTIFS(Registre_IST!$C:$C,Rap_Mens!$B$8,Registre_IST!$L:$L,Rap_Mens!$B$9,Registre_IST!$O:$O,Rap_Mens!$A15,Registre_IST!$G:$G,Rap_Mens!$D$11,Registre_IST!$I:$I,Rap_Mens!E$12,Registre_IST!$X:$X,Rap_Mens!$G$8),IF(AND($B$9=\"Tous\",$G$8<>\"\"),COUNTIFS(Registre_IST!$C:$C,Rap_Mens!$B$8,Registre_IST!$O:$O,Rap_Mens!$A15,Registre_IST!$G:$G,Rap_Mens!$D$11,Registre_IST!$I:$I,Rap_Mens!E$12,Registre_IST!$X:$X,Rap_Mens!$G$8),IF(AND($B$9=\"Tous\",$G$8=\"\"),COUNTIFS(Registre_IST!$C:$C,Rap_Mens!$B$8,Registre_IST!$O:$O,Rap_Mens!$A15,Registre_IST!$G:$G,Rap_Mens!$D$11,Registre_IST!$I:$I,Rap_Mens!E$12),IF(AND($B$9<>\"Tous\",$G$8=\"\"),COUNTIFS(Registre_IST!$C:$C,Rap_Mens!$B$8,Registre_IST!$L:$L,Rap_Mens!$B$9,Registre_IST!$O:$O,Rap_Mens!$A15,Registre_IST!$G:$G,Rap_Mens!$D$11,Registre_IST!$I:$I,Rap_Mens!E$12)))))","v":0},{"$f":"IF(AND($B$9<>\"Tous\",$G$8<>\"\"),COUNTIFS(Registre_IST!$C:$C,Rap_Mens!$B$8,Registre_IST!$L:$L,Rap_Mens!$B$9,Registre_IST!$O:$O,Rap_Mens!$A15,Registre_IST!$G:$G,Rap_Mens!$F$11,Registre_IST!$I:$I,Rap_Mens!F$12,Registre_IST!$X:$X,Rap_Mens!$G$8),IF(AND($B$9=\"Tous\",$G$8<>\"\"),COUNTIFS(Registre_IST!$C:$C,Rap_Mens!$B$8,Registre_IST!$O:$O,Rap_Mens!$A15,Registre_IST!$G:$G,Rap_Mens!$F$11,Registre_IST!$I:$I,Rap_Mens!F$12,Registre_IST!$X:$X,Rap_Mens!$G$8),IF(AND($B$9=\"Tous\",$G$8=\"\"),COUNTIFS(Registre_IST!$C:$C,Rap_Mens!$B$8,Registre_IST!$O:$O,Rap_Mens!$A15,Registre_IST!$G:$G,Rap_Mens!$F$11,Registre_IST!$I:$I,Rap_Mens!F$12),IF(AND($B$9<>\"Tous\",$G$8=\"\"),COUNTIFS(Registre_IST!$C:$C,Rap_Mens!$B$8,Registre_IST!$L:$L,Rap_Mens!$B$9,Registre_IST!$O:$O,Rap_Mens!$A15,Registre_IST!$G:$G,Rap_Mens!$F$11,Registre_IST!$I:$I,Rap_Mens!F$12)))))","v":0},{"$f":"IF(AND($B$9<>\"Tous\",$G$8<>\"\"),COUNTIFS(Registre_IST!$C:$C,Rap_Mens!$B$8,Registre_IST!$L:$L,Rap_Mens!$B$9,Registre_IST!$O:$O,Rap_Mens!$A15,Registre_IST!$G:$G,Rap_Mens!$F$11,Registre_IST!$I:$I,Rap_Mens!G$12,Registre_IST!$X:$X,Rap_Mens!$G$8),IF(AND($B$9=\"Tous\",$G$8<>\"\"),COUNTIFS(Registre_IST!$C:$C,Rap_Mens!$B$8,Registre_IST!$O:$O,Rap_Mens!$A15,Registre_IST!$G:$G,Rap_Mens!$F$11,Registre_IST!$I:$I,Rap_Mens!G$12,Registre_IST!$X:$X,Rap_Mens!$G$8),IF(AND($B$9=\"Tous\",$G$8=\"\"),COUNTIFS(Registre_IST!$C:$C,Rap_Mens!$B$8,Registre_IST!$O:$O,Rap_Mens!$A15,Registre_IST!$G:$G,Rap_Mens!$F$11,Registre_IST!$I:$I,Rap_Mens!G$12),IF(AND($B$9<>\"Tous\",$G$8=\"\"),COUNTIFS(Registre_IST!$C:$C,Rap_Mens!$B$8,Registre_IST!$L:$L,Rap_Mens!$B$9,Registre_IST!$O:$O,Rap_Mens!$A15,Registre_IST!$G:$G,Rap_Mens!$F$11,Registre_IST!$I:$I,Rap_Mens!G$12)))))","v":0},{"$f":"IF(AND($B$9<>\"Tous\",$G$8<>\"\"),COUNTIFS(Registre_IST!$C:$C,Rap_Mens!$B$8,Registre_IST!$L:$L,Rap_Mens!$B$9,Registre_IST!$O:$O,Rap_Mens!$A15,Registre_IST!$G:$G,Rap_Mens!$H$11,Registre_IST!$I:$I,Rap_Mens!H$12,Registre_IST!$X:$X,Rap_Mens!$G$8),IF(AND($B$9=\"Tous\",$G$8<>\"\"),COUNTIFS(Registre_IST!$C:$C,Rap_Mens!$B$8,Registre_IST!$O:$O,Rap_Mens!$A15,Registre_IST!$G:$G,Rap_Mens!$H$11,Registre_IST!$I:$I,Rap_Mens!H$12,Registre_IST!$X:$X,Rap_Mens!$G$8),IF(AND($B$9=\"Tous\",$G$8=\"\"),COUNTIFS(Registre_IST!$C:$C,Rap_Mens!$B$8,Registre_IST!$O:$O,Rap_Mens!$A15,Registre_IST!$G:$G,Rap_Mens!$H$11,Registre_IST!$I:$I,Rap_Mens!H$12),IF(AND($B$9<>\"Tous\",$G$8=\"\"),COUNTIFS(Registre_IST!$C:$C,Rap_Mens!$B$8,Registre_IST!$L:$L,Rap_Mens!$B$9,Registre_IST!$O:$O,Rap_Mens!$A15,Registre_IST!$G:$G,Rap_Mens!$H$11,Registre_IST!$I:$I,Rap_Mens!H$12)))))","v":0},{"$f":"IF(AND($B$9<>\"Tous\",$G$8<>\"\"),COUNTIFS(Registre_IST!$C:$C,Rap_Mens!$B$8,Registre_IST!$L:$L,Rap_Mens!$B$9,Registre_IST!$O:$O,Rap_Mens!$A15,Registre_IST!$G:$G,Rap_Mens!$H$11,Registre_IST!$I:$I,Rap_Mens!I$12,Registre_IST!$X:$X,Rap_Mens!$G$8),IF(AND($B$9=\"Tous\",$G$8<>\"\"),COUNTIFS(Registre_IST!$C:$C,Rap_Mens!$B$8,Registre_IST!$O:$O,Rap_Mens!$A15,Registre_IST!$G:$G,Rap_Mens!$H$11,Registre_IST!$I:$I,Rap_Mens!I$12,Registre_IST!$X:$X,Rap_Mens!$G$8),IF(AND($B$9=\"Tous\",$G$8=\"\"),COUNTIFS(Registre_IST!$C:$C,Rap_Mens!$B$8,Registre_IST!$O:$O,Rap_Mens!$A15,Registre_IST!$G:$G,Rap_Mens!$H$11,Registre_IST!$I:$I,Rap_Mens!I$12),IF(AND($B$9<>\"Tous\",$G$8=\"\"),COUNTIFS(Registre_IST!$C:$C,Rap_Mens!$B$8,Registre_IST!$L:$L,Rap_Mens!$B$9,Registre_IST!$O:$O,Rap_Mens!$A15,Registre_IST!$G:$G,Rap_Mens!$H$11,Registre_IST!$I:$I,Rap_Mens!I$12)))))","v":0},{"$f":"IF(AND($B$9<>\"Tous\",$G$8<>\"\"),COUNTIFS(Registre_IST!$C:$C,Rap_Mens!$B$8,Registre_IST!$L:$L,Rap_Mens!$B$9,Registre_IST!$O:$O,Rap_Mens!$A15,Registre_IST!$G:$G,Rap_Mens!$J$11,Registre_IST!$I:$I,Rap_Mens!J$12,Registre_IST!$X:$X,Rap_Mens!$G$8),IF(AND($B$9=\"Tous\",$G$8<>\"\"),COUNTIFS(Registre_IST!$C:$C,Rap_Mens!$B$8,Registre_IST!$O:$O,Rap_Mens!$A15,Registre_IST!$G:$G,Rap_Mens!$J$11,Registre_IST!$I:$I,Rap_Mens!J$12,Registre_IST!$X:$X,Rap_Mens!$G$8),IF(AND($B$9=\"Tous\",$G$8=\"\"),COUNTIFS(Registre_IST!$C:$C,Rap_Mens!$B$8,Registre_IST!$O:$O,Rap_Mens!$A15,Registre_IST!$G:$G,Rap_Mens!$J$11,Registre_IST!$I:$I,Rap_Mens!J$12),IF(AND($B$9<>\"Tous\",$G$8=\"\"),COUNTIFS(Registre_IST!$C:$C,Rap_Mens!$B$8,Registre_IST!$L:$L,Rap_Mens!$B$9,Registre_IST!$O:$O,Rap_Mens!$A15,Registre_IST!$G:$G,Rap_Mens!$J$11,Registre_IST!$I:$I,Rap_Mens!J$12)))))","v":0},{"$f":"IF(AND($B$9<>\"Tous\",$G$8<>\"\"),COUNTIFS(Registre_IST!$C:$C,Rap_Mens!$B$8,Registre_IST!$L:$L,Rap_Mens!$B$9,Registre_IST!$O:$O,Rap_Mens!$A15,Registre_IST!$G:$G,Rap_Mens!$J$11,Registre_IST!$I:$I,Rap_Mens!K$12,Registre_IST!$X:$X,Rap_Mens!$G$8),IF(AND($B$9=\"Tous\",$G$8<>\"\"),COUNTIFS(Registre_IST!$C:$C,Rap_Mens!$B$8,Registre_IST!$O:$O,Rap_Mens!$A15,Registre_IST!$G:$G,Rap_Mens!$J$11,Registre_IST!$I:$I,Rap_Mens!K$12,Registre_IST!$X:$X,Rap_Mens!$G$8),IF(AND($B$9=\"Tous\",$G$8=\"\"),COUNTIFS(Registre_IST!$C:$C,Rap_Mens!$B$8,Registre_IST!$O:$O,Rap_Mens!$A15,Registre_IST!$G:$G,Rap_Mens!$J$11,Registre_IST!$I:$I,Rap_Mens!K$12),IF(AND($B$9<>\"Tous\",$G$8=\"\"),COUNTIFS(Registre_IST!$C:$C,Rap_Mens!$B$8,Registre_IST!$L:$L,Rap_Mens!$B$9,Registre_IST!$O:$O,Rap_Mens!$A15,Registre_IST!$G:$G,Rap_Mens!$J$11,Registre_IST!$I:$I,Rap_Mens!K$12)))))","v":0}]
["Ulcère génital",{"$f":"IF(AND($B$9<>\"Tous\",$G$8<>\"\"),COUNTIFS(Registre_IST!$C:$C,Rap_Mens!$B$8,Registre_IST!$L:$L,Rap_Mens!$B$9,Registre_IST!$O:$O,Rap_Mens!$A16,Registre_IST!$G:$G,Rap_Mens!$B$11,Registre_IST!$I:$I,Rap_Mens!B$12,Registre_IST!$X:$X,Rap_Mens!$G$8),IF(AND($B$9=\"Tous\",$G$8<>\"\"),COUNTIFS(Registre_IST!$C:$C,Rap_Mens!$B$8,Registre_IST!$O:$O,Rap_Mens!$A16,Registre_IST!$G:$G,Rap_Mens!$B$11,Registre_IST!$I:$I,Rap_Mens!B$12,Registre_IST!$X:$X,Rap_Mens!$G$8),IF(AND($B$9=\"Tous\",$G$8=\"\"),COUNTIFS(Registre_IST!$C:$C,Rap_Mens!$B$8,Registre_IST!$O:$O,Rap_Mens!$A16,Registre_IST!$G:$G,Rap_Mens!$B$11,Registre_IST!$I:$I,Rap_Mens!B$12),IF(AND($B$9<>\"Tous\",$G$8=\"\"),COUNTIFS(Registre_IST!$C:$C,Rap_Mens!$B$8,Registre_IST!$L:$L,Rap_Mens!$B$9,Registre_IST!$O:$O,Rap_Mens!$A16,Registre_IST!$G:$G,Rap_Mens!$B$11,Registre_IST!$I:$I,Rap_Mens!B$12)))))","v":0},{"$f":"IF(AND($B$9<>\"Tous\",$G$8<>\"\"),COUNTIFS(Registre_IST!$C:$C,Rap_Mens!$B$8,Registre_IST!$L:$L,Rap_Mens!$B$9,Registre_IST!$O:$O,Rap_Mens!$A16,Registre_IST!$G:$G,Rap_Mens!$B$11,Registre_IST!$I:$I,Rap_Mens!C$12,Registre_IST!$X:$X,Rap_Mens!$G$8),IF(AND($B$9=\"Tous\",$G$8<>\"\"),COUNTIFS(Registre_IST!$C:$C,Rap_Mens!$B$8,Registre_IST!$O:$O,Rap_Mens!$A16,Registre_IST!$G:$G,Rap_Mens!$B$11,Registre_IST!$I:$I,Rap_Mens!C$12,Registre_IST!$X:$X,Rap_Mens!$G$8),IF(AND($B$9=\"Tous\",$G$8=\"\"),COUNTIFS(Registre_IST!$C:$C,Rap_Mens!$B$8,Registre_IST!$O:$O,Rap_Mens!$A16,Registre_IST!$G:$G,Rap_Mens!$B$11,Registre_IST!$I:$I,Rap_Mens!C$12),IF(AND($B$9<>\"Tous\",$G$8=\"\"),COUNTIFS(Registre_IST!$C:$C,Rap_Mens!$B$8,Registre_IST!$L:$L,Rap_Mens!$B$9,Registre_IST!$O:$O,Rap_Mens!$A16,Registre_IST!$G:$G,Rap_Mens!$B$11,Registre_IST!$I:$I,Rap_Mens!C$12)))))","v":0},{"$f":"IF(AND($B$9<>\"Tous\",$G$8<>\"\"),COUNTIFS(Registre_IST!$C:$C,Rap_Mens!$B$8,Registre_IST!$L:$L,Rap_Mens!$B$9,Registre_IST!$O:$O,Rap_Mens!$A16,Registre_IST!$G:$G,Rap_Mens!$D$11,Registre_IST!$I:$I,Rap_Mens!D$12,Registre_IST!$X:$X,Rap_Mens!$G$8),IF(AND($B$9=\"Tous\",$G$8<>\"\"),COUNTIFS(Registre_IST!$C:$C,Rap_Mens!$B$8,Registre_IST!$O:$O,Rap_Mens!$A16,Registre_IST!$G:$G,Rap_Mens!$D$11,Registre_IST!$I:$I,Rap_Mens!D$12,Registre_IST!$X:$X,Rap_Mens!$G$8),IF(AND($B$9=\"Tous\",$G$8=\"\"),COUNTIFS(Registre_IST!$C:$C,Rap_Mens!$B$8,Registre_IST!$O:$O,Rap_Mens!$A16,Registre_IST!$G:$G,Rap_Mens!$D$11,Registre_IST!$I:$I,Rap_Mens!D$12),IF(AND($B$9<>\"Tous\",$G$8=\"\"),COUNTIFS(Registre_IST!$C:$C,Rap_Mens!$B$8,Registre_IST!$L:$L,Rap_Mens!$B$9,Registre_IST!$O:$O,Rap_Mens!$A16,Registre_IST!$G:$G,Rap_Mens!$D$11,Registre_IST!$I:$I,Rap_Mens!D$12)))))","v":0},{"$f":"IF(AND($B$9<>\"Tous\",$G$8<>\"\"),COUNTIFS(Registre_IST!$C:$C,Rap_Mens!$B$8,Registre_IST!$L:$L,Rap_Mens!$B$9,Registre_IST!$O:$O,Rap_Mens!$A16,Registre_IST!$G:$G,Rap_Mens!$D$11,Registre_IST!$I:$I,Rap_Mens!E$12,Registre_IST!$X:$X,Rap_Mens!$G$8),IF(AND($B$9=\"Tous\",$G$8<>\"\"),COUNTIFS(Registre_IST!$C:$C,Rap_Mens!$B$8,Registre_IST!$O:$O,Rap_Mens!$A16,Registre_IST!$G:$G,Rap_Mens!$D$11,Registre_IST!$I:$I,Rap_Mens!E$12,Registre_IST!$X:$X,Rap_Mens!$G$8),IF(AND($B$9=\"Tous\",$G$8=\"\"),COUNTIFS(Registre_IST!$C:$C,Rap_Mens!$B$8,Registre_IST!$O:$O,Rap_Mens!$A16,Registre_IST!$G:$G,Rap_Mens!$D$11,Registre_IST!$I:$I,Rap_Mens!E$12),IF(AND($B$9<>\"Tous\",$G$8=\"\"),COUNTIFS(Registre_IST!$C:$C,Rap_Mens!$B$8,Registre_IST!$L:$L,Rap_Mens!$B$9,Registre_IST!$O:$O,Rap_Mens!$A16,Registre_IST!$G:$G,Rap_Mens!$D$11,Registre_IST!$I:$I,Rap_Mens!E$12)))))","v":0},{"$f":"IF(AND($B$9<>\"Tous\",$G$8<>\"\"),COUNTIFS(Registre_IST!$C:$C,Rap_Mens!$B$8,Registre_IST!$L:$L,Rap_Mens!$B$9,Registre_IST!$O:$O,Rap_Mens!$A16,Registre_IST!$G:$G,Rap_Mens!$F$11,Registre_IST!$I:$I,Rap_Mens!F$12,Registre_IST!$X:$X,Rap_Mens!$G$8),IF(AND($B$9=\"Tous\",$G$8<>\"\"),COUNTIFS(Registre_IST!$C:$C,Rap_Mens!$B$8,Registre_IST!$O:$O,Rap_Mens!$A16,Registre_IST!$G:$G,Rap_Mens!$F$11,Registre_IST!$I:$I,Rap_Mens!F$12,Registre_IST!$X:$X,Rap_Mens!$G$8),IF(AND($B$9=\"Tous\",$G$8=\"\"),COUNTIFS(Registre_IST!$C:$C,Rap_Mens!$B$8,Registre_IST!$O:$O,Rap_Mens!$A16,Registre_IST!$G:$G,Rap_Mens!$F$11,Registre_IST!$I:$I,Rap_Mens!F$12),IF(AND($B$9<>\"Tous\",$G$8=\"\"),COUNTIFS(Registre_IST!$C:$C,Rap_Mens!$B$8,Registre_IST!$L:$L,Rap_Mens!$B$9,Registre_IST!$O:$O,Rap_Mens!$A16,Registre_IST!$G:$G,Rap_Mens!$F$11,Registre_IST!$I:$I,Rap_Mens!F$12)))))","v":0},{"$f":"IF(AND($B$9<>\"Tous\",$G$8<>\"\"),COUNTIFS(Registre_IST!$C:$C,Rap_Mens!$B$8,Registre_IST!$L:$L,Rap_Mens!$B$9,Registre_IST!$O:$O,Rap_Mens!$A16,Registre_IST!$G:$G,Rap_Mens!$F$11,Registre_IST!$I:$I,Rap_Mens!G$12,Registre_IST!$X:$X,Rap_Mens!$G$8),IF(AND($B$9=\"Tous\",$G$8<>\"\"),COUNTIFS(Registre_IST!$C:$C,Rap_Mens!$B$8,Registre_IST!$O:$O,Rap_Mens!$A16,Registre_IST!$G:$G,Rap_Mens!$F$11,Registre_IST!$I:$I,Rap_Mens!G$12,Registre_IST!$X:$X,Rap_Mens!$G$8),IF(AND($B$9=\"Tous\",$G$8=\"\"),COUNTIFS(Registre_IST!$C:$C,Rap_Mens!$B$8,Registre_IST!$O:$O,Rap_Mens!$A16,Registre_IST!$G:$G,Rap_Mens!$F$11,Registre_IST!$I:$I,Rap_Mens!G$12),IF(AND($B$9<>\"Tous\",$G$8=\"\"),COUNTIFS(Registre_IST!$C:$C,Rap_Mens!$B$8,Registre_IST!$L:$L,Rap_Mens!$B$9,Registre_IST!$O:$O,Rap_Mens!$A16,Registre_IST!$G:$G,Rap_Mens!$F$11,Registre_IST!$I:$I,Rap_Mens!G$12)))))","v":0},{"$f":"IF(AND($B$9<>\"Tous\",$G$8<>\"\"),COUNTIFS(Registre_IST!$C:$C,Rap_Mens!$B$8,Registre_IST!$L:$L,Rap_Mens!$B$9,Registre_IST!$O:$O,Rap_Mens!$A16,Registre_IST!$G:$G,Rap_Mens!$H$11,Registre_IST!$I:$I,Rap_Mens!H$12,Registre_IST!$X:$X,Rap_Mens!$G$8),IF(AND($B$9=\"Tous\",$G$8<>\"\"),COUNTIFS(Registre_IST!$C:$C,Rap_Mens!$B$8,Registre_IST!$O:$O,Rap_Mens!$A16,Registre_IST!$G:$G,Rap_Mens!$H$11,Registre_IST!$I:$I,Rap_Mens!H$12,Registre_IST!$X:$X,Rap_Mens!$G$8),IF(AND($B$9=\"Tous\",$G$8=\"\"),COUNTIFS(Registre_IST!$C:$C,Rap_Mens!$B$8,Registre_IST!$O:$O,Rap_Mens!$A16,Registre_IST!$G:$G,Rap_Mens!$H$11,Registre_IST!$I:$I,Rap_Mens!H$12),IF(AND($B$9<>\"Tous\",$G$8=\"\"),COUNTIFS(Registre_IST!$C:$C,Rap_Mens!$B$8,Registre_IST!$L:$L,Rap_Mens!$B$9,Registre_IST!$O:$O,Rap_Mens!$A16,Registre_IST!$G:$G,Rap_Mens!$H$11,Registre_IST!$I:$I,Rap_Mens!H$12)))))","v":0},{"$f":"IF(AND($B$9<>\"Tous\",$G$8<>\"\"),COUNTIFS(Registre_IST!$C:$C,Rap_Mens!$B$8,Registre_IST!$L:$L,Rap_Mens!$B$9,Registre_IST!$O:$O,Rap_Mens!$A16,Registre_IST!$G:$G,Rap_Mens!$H$11,Registre_IST!$I:$I,Rap_Mens!I$12,Registre_IST!$X:$X,Rap_Mens!$G$8),IF(AND($B$9=\"Tous\",$G$8<>\"\"),COUNTIFS(Registre_IST!$C:$C,Rap_Mens!$B$8,Registre_IST!$O:$O,Rap_Mens!$A16,Registre_IST!$G:$G,Rap_Mens!$H$11,Registre_IST!$I:$I,Rap_Mens!I$12,Registre_IST!$X:$X,Rap_Mens!$G$8),IF(AND($B$9=\"Tous\",$G$8=\"\"),COUNTIFS(Registre_IST!$C:$C,Rap_Mens!$B$8,Registre_IST!$O:$O,Rap_Mens!$A16,Registre_IST!$G:$G,Rap_Mens!$H$11,Registre_IST!$I:$I,Rap_Mens!I$12),IF(AND($B$9<>\"Tous\",$G$8=\"\"),COUNTIFS(Registre_IST!$C:$C,Rap_Mens!$B$8,Registre_IST!$L:$L,Rap_Mens!$B$9,Registre_IST!$O:$O,Rap_Mens!$A16,Registre_IST!$G:$G,Rap_Mens!$H$11,Registre_IST!$I:$I,Rap_Mens!I$12)))))","v":0},{"$f":"IF(AND($B$9<>\"Tous\",$G$8<>\"\"),COUNTIFS(Registre_IST!$C:$C,Rap_Mens!$B$8,Registre_IST!$L:$L,Rap_Mens!$B$9,Registre_IST!$O:$O,Rap_Mens!$A16,Registre_IST!$G:$G,Rap_Mens!$J$11,Registre_IST!$I:$I,Rap_Mens!J$12,Registre_IST!$X:$X,Rap_Mens!$G$8),IF(AND($B$9=\"Tous\",$G$8<>\"\"),COUNTIFS(Registre_IST!$C:$C,Rap_Mens!$B$8,Registre_IST!$O:$O,Rap_Mens!$A16,Registre_IST!$G:$G,Rap_Mens!$J$11,Registre_IST!$I:$I,Rap_Mens!J$12,Registre_IST!$X:$X,Rap_Mens!$G$8),IF(AND($B$9=\"Tous\",$G$8=\"\"),COUNTIFS(Registre_IST!$C:$C,Rap_Mens!$B$8,Registre_IST!$O:$O,Rap_Mens!$A16,Registre_IST!$G:$G,Rap_Mens!$J$11,Registre_IST!$I:$I,Rap_Mens!J$12),IF(AND($B$9<>\"Tous\",$G$8=\"\"),COUNTIFS(Registre_IST!$C:$C,Rap_Mens!$B$8,Registre_IST!$L:$L,Rap_Mens!$B$9,Registre_IST!$O:$O,Rap_Mens!$A16,Registre_IST!$G:$G,Rap_Mens!$J$11,Registre_IST!$I:$I,Rap_Mens!J$12)))))","v":0},{"$f":"IF(AND($B$9<>\"Tous\",$G$8<>\"\"),COUNTIFS(Registre_IST!$C:$C,Rap_Mens!$B$8,Registre_IST!$L:$L,Rap_Mens!$B$9,Registre_IST!$O:$O,Rap_Mens!$A16,Registre_IST!$G:$G,Rap_Mens!$J$11,Registre_IST!$I:$I,Rap_Mens!K$12,Registre_IST!$X:$X,Rap_Mens!$G$8),IF(AND($B$9=\"Tous\",$G$8<>\"\"),COUNTIFS(Registre_IST!$C:$C,Rap_Mens!$B$8,Registre_IST!$O:$O,Rap_Mens!$A16,Registre_IST!$G:$G,Rap_Mens!$J$11,Registre_IST!$I:$I,Rap_Mens!K$12,Registre_IST!$X:$X,Rap_Mens!$G$8),IF(AND($B$9=\"Tous\",$G$8=\"\"),COUNTIFS(Registre_IST!$C:$C,Rap_Mens!$B$8,Registre_IST!$O:$O,Rap_Mens!$A16,Registre_IST!$G:$G,Rap_Mens!$J$11,Registre_IST!$I:$I,Rap_Mens!K$12),IF(AND($B$9<>\"Tous\",$G$8=\"\"),COUNTIFS(Registre_IST!$C:$C,Rap_Mens!$B$8,Registre_IST!$L:$L,Rap_Mens!$B$9,Registre_IST!$O:$O,Rap_Mens!$A16,Registre_IST!$G:$G,Rap_Mens!$J$11,Registre_IST!$I:$I,Rap_Mens!K$12)))))","v":0}]
["Douleurs bas ventre",{"$f":"IF(AND($B$9<>\"Tous\",$G$8<>\"\"),COUNTIFS(Registre_IST!$C:$C,Rap_Mens!$B$8,Registre_IST!$L:$L,Rap_Mens!$B$9,Registre_IST!$O:$O,Rap_Mens!$A17,Registre_IST!$G:$G,Rap_Mens!$B$11,Registre_IST!$I:$I,Rap_Mens!B$12,Registre_IST!$X:$X,Rap_Mens!$G$8),IF(AND($B$9=\"Tous\",$G$8<>\"\"),COUNTIFS(Registre_IST!$C:$C,Rap_Mens!$B$8,Registre_IST!$O:$O,Rap_Mens!$A17,Registre_IST!$G:$G,Rap_Mens!$B$11,Registre_IST!$I:$I,Rap_Mens!B$12,Registre_IST!$X:$X,Rap_Mens!$G$8),IF(AND($B$9=\"Tous\",$G$8=\"\"),COUNTIFS(Registre_IST!$C:$C,Rap_Mens!$B$8,Registre_IST!$O:$O,Rap_Mens!$A17,Registre_IST!$G:$G,Rap_Mens!$B$11,Registre_IST!$I:$I,Rap_Mens!B$12),IF(AND($B$9<>\"Tous\",$G$8=\"\"),COUNTIFS(Registre_IST!$C:$C,Rap_Mens!$B$8,Registre_IST!$L:$L,Rap_Mens!$B$9,Registre_IST!$O:$O,Rap_Mens!$A17,Registre_IST!$G:$G,Rap_Mens!$B$11,Registre_IST!$I:$I,Rap_Mens!B$12)))))","v":0},{"$f":"IF(AND($B$9<>\"Tous\",$G$8<>\"\"),COUNTIFS(Registre_IST!$C:$C,Rap_Mens!$B$8,Registre_IST!$L:$L,Rap_Mens!$B$9,Registre_IST!$O:$O,Rap_Mens!$A17,Registre_IST!$G:$G,Rap_Mens!$B$11,Registre_IST!$I:$I,Rap_Mens!C$12,Registre_IST!$X:$X,Rap_Mens!$G$8),IF(AND($B$9=\"Tous\",$G$8<>\"\"),COUNTIFS(Registre_IST!$C:$C,Rap_Mens!$B$8,Registre_IST!$O:$O,Rap_Mens!$A17,Registre_IST!$G:$G,Rap_Mens!$B$11,Registre_IST!$I:$I,Rap_Mens!C$12,Registre_IST!$X:$X,Rap_Mens!$G$8),IF(AND($B$9=\"Tous\",$G$8=\"\"),COUNTIFS(Registre_IST!$C:$C,Rap_Mens!$B$8,Registre_IST!$O:$O,Rap_Mens!$A17,Registre_IST!$G:$G,Rap_Mens!$B$11,Registre_IST!$I:$I,Rap_Mens!C$12),IF(AND($B$9<>\"Tous\",$G$8=\"\"),COUNTIFS(Registre_IST!$C:$C,Rap_Mens!$B$8,Registre_IST!$L:$L,Rap_Mens!$B$9,Registre_IST!$O:$O,Rap_Mens!$A17,Registre_IST!$G:$G,Rap_Mens!$B$11,Registre_IST!$I:$I,Rap_Mens!C$12)))))","v":0},{"$f":"IF(AND($B$9<>\"Tous\",$G$8<>\"\"),COUNTIFS(Registre_IST!$C:$C,Rap_Mens!$B$8,Registre_IST!$L:$L,Rap_Mens!$B$9,Registre_IST!$O:$O,Rap_Mens!$A17,Registre_IST!$G:$G,Rap_Mens!$D$11,Registre_IST!$I:$I,Rap_Mens!D$12,Registre_IST!$X:$X,Rap_Mens!$G$8),IF(AND($B$9=\"Tous\",$G$8<>\"\"),COUNTIFS(Registre_IST!$C:$C,Rap_Mens!$B$8,Registre_IST!$O:$O,Rap_Mens!$A17,Registre_IST!$G:$G,Rap_Mens!$D$11,Registre_IST!$I:$I,Rap_Mens!D$12,Registre_IST!$X:$X,Rap_Mens!$G$8),IF(AND($B$9=\"Tous\",$G$8=\"\"),COUNTIFS(Registre_IST!$C:$C,Rap_Mens!$B$8,Registre_IST!$O:$O,Rap_Mens!$A17,Registre_IST!$G:$G,Rap_Mens!$D$11,Registre_IST!$I:$I,Rap_Mens!D$12),IF(AND($B$9<>\"Tous\",$G$8=\"\"),COUNTIFS(Registre_IST!$C:$C,Rap_Mens!$B$8,Registre_IST!$L:$L,Rap_Mens!$B$9,Registre_IST!$O:$O,Rap_Mens!$A17,Registre_IST!$G:$G,Rap_Mens!$D$11,Registre_IST!$I:$I,Rap_Mens!D$12)))))","v":0},{"$f":"IF(AND($B$9<>\"Tous\",$G$8<>\"\"),COUNTIFS(Registre_IST!$C:$C,Rap_Mens!$B$8,Registre_IST!$L:$L,Rap_Mens!$B$9,Registre_IST!$O:$O,Rap_Mens!$A17,Registre_IST!$G:$G,Rap_Mens!$D$11,Registre_IST!$I:$I,Rap_Mens!E$12,Registre_IST!$X:$X,Rap_Mens!$G$8),IF(AND($B$9=\"Tous\",$G$8<>\"\"),COUNTIFS(Registre_IST!$C:$C,Rap_Mens!$B$8,Registre_IST!$O:$O,Rap_Mens!$A17,Registre_IST!$G:$G,Rap_Mens!$D$11,Registre_IST!$I:$I,Rap_Mens!E$12,Registre_IST!$X:$X,Rap_Mens!$G$8),IF(AND($B$9=\"Tous\",$G$8=\"\"),COUNTIFS(Registre_IST!$C:$C,Rap_Mens!$B$8,Registre_IST!$O:$O,Rap_Mens!$A17,Registre_IST!$G:$G,Rap_Mens!$D$11,Registre_IST!$I:$I,Rap_Mens!E$12),IF(AND($B$9<>\"Tous\",$G$8=\"\"),COUNTIFS(Registre_IST!$C:$C,Rap_Mens!$B$8,Registre_IST!$L:$L,Rap_Mens!$B$9,Registre_IST!$O:$O,Rap_Mens!$A17,Registre_IST!$G:$G,Rap_Mens!$D$11,Registre_IST!$I:$I,Rap_Mens!E$12)))))","v":0},{"$f":"IF(AND($B$9<>\"Tous\",$G$8<>\"\"),COUNTIFS(Registre_IST!$C:$C,Rap_Mens!$B$8,Registre_IST!$L:$L,Rap_Mens!$B$9,Registre_IST!$O:$O,Rap_Mens!$A17,Registre_IST!$G:$G,Rap_Mens!$F$11,Registre_IST!$I:$I,Rap_Mens!F$12,Registre_IST!$X:$X,Rap_Mens!$G$8),IF(AND($B$9=\"Tous\",$G$8<>\"\"),COUNTIFS(Registre_IST!$C:$C,Rap_Mens!$B$8,Registre_IST!$O:$O,Rap_Mens!$A17,Registre_IST!$G:$G,Rap_Mens!$F$11,Registre_IST!$I:$I,Rap_Mens!F$12,Registre_IST!$X:$X,Rap_Mens!$G$8),IF(AND($B$9=\"Tous\",$G$8=\"\"),COUNTIFS(Registre_IST!$C:$C,Rap_Mens!$B$8,Registre_IST!$O:$O,Rap_Mens!$A17,Registre_IST!$G:$G,Rap_Mens!$F$11,Registre_IST!$I:$I,Rap_Mens!F$12),IF(AND($B$9<>\"Tous\",$G$8=\"\"),COUNTIFS(Registre_IST!$C:$C,Rap_Mens!$B$8,Registre_IST!$L:$L,Rap_Mens!$B$9,Registre_IST!$O:$O,Rap_Mens!$A17,Registre_IST!$G:$G,Rap_Mens!$F$11,Registre_IST!$I:$I,Rap_Mens!F$12)))))","v":0},{"$f":"IF(AND($B$9<>\"Tous\",$G$8<>\"\"),COUNTIFS(Registre_IST!$C:$C,Rap_Mens!$B$8,Registre_IST!$L:$L,Rap_Mens!$B$9,Registre_IST!$O:$O,Rap_Mens!$A17,Registre_IST!$G:$G,Rap_Mens!$F$11,Registre_IST!$I:$I,Rap_Mens!G$12,Registre_IST!$X:$X,Rap_Mens!$G$8),IF(AND($B$9=\"Tous\",$G$8<>\"\"),COUNTIFS(Registre_IST!$C:$C,Rap_Mens!$B$8,Registre_IST!$O:$O,Rap_Mens!$A17,Registre_IST!$G:$G,Rap_Mens!$F$11,Registre_IST!$I:$I,Rap_Mens!G$12,Registre_IST!$X:$X,Rap_Mens!$G$8),IF(AND($B$9=\"Tous\",$G$8=\"\"),COUNTIFS(Registre_IST!$C:$C,Rap_Mens!$B$8,Registre_IST!$O:$O,Rap_Mens!$A17,Registre_IST!$G:$G,Rap_Mens!$F$11,Registre_IST!$I:$I,Rap_Mens!G$12),IF(AND($B$9<>\"Tous\",$G$8=\"\"),COUNTIFS(Registre_IST!$C:$C,Rap_Mens!$B$8,Registre_IST!$L:$L,Rap_Mens!$B$9,Registre_IST!$O:$O,Rap_Mens!$A17,Registre_IST!$G:$G,Rap_Mens!$F$11,Registre_IST!$I:$I,Rap_Mens!G$12)))))","v":0},{"$f":"IF(AND($B$9<>\"Tous\",$G$8<>\"\"),COUNTIFS(Registre_IST!$C:$C,Rap_Mens!$B$8,Registre_IST!$L:$L,Rap_Mens!$B$9,Registre_IST!$O:$O,Rap_Mens!$A17,Registre_IST!$G:$G,Rap_Mens!$H$11,Registre_IST!$I:$I,Rap_Mens!H$12,Registre_IST!$X:$X,Rap_Mens!$G$8),IF(AND($B$9=\"Tous\",$G$8<>\"\"),COUNTIFS(Registre_IST!$C:$C,Rap_Mens!$B$8,Registre_IST!$O:$O,Rap_Mens!$A17,Registre_IST!$G:$G,Rap_Mens!$H$11,Registre_IST!$I:$I,Rap_Mens!H$12,Registre_IST!$X:$X,Rap_Mens!$G$8),IF(AND($B$9=\"Tous\",$G$8=\"\"),COUNTIFS(Registre_IST!$C:$C,Rap_Mens!$B$8,Registre_IST!$O:$O,Rap_Mens!$A17,Registre_IST!$G:$G,Rap_Mens!$H$11,Registre_IST!$I:$I,Rap_Mens!H$12),IF(AND($B$9<>\"Tous\",$G$8=\"\"),COUNTIFS(Registre_IST!$C:$C,Rap_Mens!$B$8,Registre_IST!$L:$L,Rap_Mens!$B$9,Registre_IST!$O:$O,Rap_Mens!$A17,Registre_IST!$G:$G,Rap_Mens!$H$11,Registre_IST!$I:$I,Rap_Mens!H$12)))))","v":0},{"$f":"IF(AND($B$9<>\"Tous\",$G$8<>\"\"),COUNTIFS(Registre_IST!$C:$C,Rap_Mens!$B$8,Registre_IST!$L:$L,Rap_Mens!$B$9,Registre_IST!$O:$O,Rap_Mens!$A17,Registre_IST!$G:$G,Rap_Mens!$H$11,Registre_IST!$I:$I,Rap_Mens!I$12,Registre_IST!$X:$X,Rap_Mens!$G$8),IF(AND($B$9=\"Tous\",$G$8<>\"\"),COUNTIFS(Registre_IST!$C:$C,Rap_Mens!$B$8,Registre_IST!$O:$O,Rap_Mens!$A17,Registre_IST!$G:$G,Rap_Mens!$H$11,Registre_IST!$I:$I,Rap_Mens!I$12,Registre_IST!$X:$X,Rap_Mens!$G$8),IF(AND($B$9=\"Tous\",$G$8=\"\"),COUNTIFS(Registre_IST!$C:$C,Rap_Mens!$B$8,Registre_IST!$O:$O,Rap_Mens!$A17,Registre_IST!$G:$G,Rap_Mens!$H$11,Registre_IST!$I:$I,Rap_Mens!I$12),IF(AND($B$9<>\"Tous\",$G$8=\"\"),COUNTIFS(Registre_IST!$C:$C,Rap_Mens!$B$8,Registre_IST!$L:$L,Rap_Mens!$B$9,Registre_IST!$O:$O,Rap_Mens!$A17,Registre_IST!$G:$G,Rap_Mens!$H$11,Registre_IST!$I:$I,Rap_Mens!I$12)))))","v":0},{"$f":"IF(AND($B$9<>\"Tous\",$G$8<>\"\"),COUNTIFS(Registre_IST!$C:$C,Rap_Mens!$B$8,Registre_IST!$L:$L,Rap_Mens!$B$9,Registre_IST!$O:$O,Rap_Mens!$A17,Registre_IST!$G:$G,Rap_Mens!$J$11,Registre_IST!$I:$I,Rap_Mens!J$12,Registre_IST!$X:$X,Rap_Mens!$G$8),IF(AND($B$9=\"Tous\",$G$8<>\"\"),COUNTIFS(Registre_IST!$C:$C,Rap_Mens!$B$8,Registre_IST!$O:$O,Rap_Mens!$A17,Registre_IST!$G:$G,Rap_Mens!$J$11,Registre_IST!$I:$I,Rap_Mens!J$12,Registre_IST!$X:$X,Rap_Mens!$G$8),IF(AND($B$9=\"Tous\",$G$8=\"\"),COUNTIFS(Registre_IST!$C:$C,Rap_Mens!$B$8,Registre_IST!$O:$O,Rap_Mens!$A17,Registre_IST!$G:$G,Rap_Mens!$J$11,Registre_IST!$I:$I,Rap_Mens!J$12),IF(AND($B$9<>\"Tous\",$G$8=\"\"),COUNTIFS(Registre_IST!$C:$C,Rap_Mens!$B$8,Registre_IST!$L:$L,Rap_Mens!$B$9,Registre_IST!$O:$O,Rap_Mens!$A17,Registre_IST!$G:$G,Rap_Mens!$J$11,Registre_IST!$I:$I,Rap_Mens!J$12)))))","v":0},{"$f":"IF(AND($B$9<>\"Tous\",$G$8<>\"\"),COUNTIFS(Registre_IST!$C:$C,Rap_Mens!$B$8,Registre_IST!$L:$L,Rap_Mens!$B$9,Registre_IST!$O:$O,Rap_Mens!$A17,Registre_IST!$G:$G,Rap_Mens!$J$11,Registre_IST!$I:$I,Rap_Mens!K$12,Registre_IST!$X:$X,Rap_Mens!$G$8),IF(AND($B$9=\"Tous\",$G$8<>\"\"),COUNTIFS(Registre_IST!$C:$C,Rap_Mens!$B$8,Registre_IST!$O:$O,Rap_Mens!$A17,Registre_IST!$G:$G,Rap_Mens!$J$11,Registre_IST!$I:$I,Rap_Mens!K$12,Registre_IST!$X:$X,Rap_Mens!$G$8),IF(AND($B$9=\"Tous\",$G$8=\"\"),COUNTIFS(Registre_IST!$C:$C,Rap_Mens!$B$8,Registre_IST!$O:$O,Rap_Mens!$A17,Registre_IST!$G:$G,Rap_Mens!$J$11,Registre_IST!$I:$I,Rap_Mens!K$12),IF(AND($B$9<>\"Tous\",$G$8=\"\"),COUNTIFS(Registre_IST!$C:$C,Rap_Mens!$B$8,Registre_IST!$L:$L,Rap_Mens!$B$9,Registre_IST!$O:$O,Rap_Mens!$A17,Registre_IST!$G:$G,Rap_Mens!$J$11,Registre_IST!$I:$I,Rap_Mens!K$12)))))","v":0}]
["Autres",{"$f":"IF(AND($B$9<>\"Tous\",$G$8<>\"\"),COUNTIFS(Registre_IST!$C:$C,Rap_Mens!$B$8,Registre_IST!$L:$L,Rap_Mens!$B$9,Registre_IST!$O:$O,Rap_Mens!$A18,Registre_IST!$G:$G,Rap_Mens!$B$11,Registre_IST!$I:$I,Rap_Mens!B$12,Registre_IST!$X:$X,Rap_Mens!$G$8),IF(AND($B$9=\"Tous\",$G$8<>\"\"),COUNTIFS(Registre_IST!$C:$C,Rap_Mens!$B$8,Registre_IST!$O:$O,Rap_Mens!$A18,Registre_IST!$G:$G,Rap_Mens!$B$11,Registre_IST!$I:$I,Rap_Mens!B$12,Registre_IST!$X:$X,Rap_Mens!$G$8),IF(AND($B$9=\"Tous\",$G$8=\"\"),COUNTIFS(Registre_IST!$C:$C,Rap_Mens!$B$8,Registre_IST!$O:$O,Rap_Mens!$A18,Registre_IST!$G:$G,Rap_Mens!$B$11,Registre_IST!$I:$I,Rap_Mens!B$12),IF(AND($B$9<>\"Tous\",$G$8=\"\"),COUNTIFS(Registre_IST!$C:$C,Rap_Mens!$B$8,Registre_IST!$L:$L,Rap_Mens!$B$9,Registre_IST!$O:$O,Rap_Mens!$A18,Registre_IST!$G:$G,Rap_Mens!$B$11,Registre_IST!$I:$I,Rap_Mens!B$12)))))","v":0},{"$f":"IF(AND($B$9<>\"Tous\",$G$8<>\"\"),COUNTIFS(Registre_IST!$C:$C,Rap_Mens!$B$8,Registre_IST!$L:$L,Rap_Mens!$B$9,Registre_IST!$O:$O,Rap_Mens!$A18,Registre_IST!$G:$G,Rap_Mens!$B$11,Registre_IST!$I:$I,Rap_Mens!C$12,Registre_IST!$X:$X,Rap_Mens!$G$8),IF(AND($B$9=\"Tous\",$G$8<>\"\"),COUNTIFS(Registre_IST!$C:$C,Rap_Mens!$B$8,Registre_IST!$O:$O,Rap_Mens!$A18,Registre_IST!$G:$G,Rap_Mens!$B$11,Registre_IST!$I:$I,Rap_Mens!C$12,Registre_IST!$X:$X,Rap_Mens!$G$8),IF(AND($B$9=\"Tous\",$G$8=\"\"),COUNTIFS(Registre_IST!$C:$C,Rap_Mens!$B$8,Registre_IST!$O:$O,Rap_Mens!$A18,Registre_IST!$G:$G,Rap_Mens!$B$11,Registre_IST!$I:$I,Rap_Mens!C$12),IF(AND($B$9<>\"Tous\",$G$8=\"\"),COUNTIFS(Registre_IST!$C:$C,Rap_Mens!$B$8,Registre_IST!$L:$L,Rap_Mens!$B$9,Registre_IST!$O:$O,Rap_Mens!$A18,Registre_IST!$G:$G,Rap_Mens!$B$11,Registre_IST!$I:$I,Rap_Mens!C$12)))))","v":0},{"$f":"IF(AND($B$9<>\"Tous\",$G$8<>\"\"),COUNTIFS(Registre_IST!$C:$C,Rap_Mens!$B$8,Registre_IST!$L:$L,Rap_Mens!$B$9,Registre_IST!$O:$O,Rap_Mens!$A18,Registre_IST!$G:$G,Rap_Mens!$D$11,Registre_IST!$I:$I,Rap_Mens!D$12,Registre_IST!$X:$X,Rap_Mens!$G$8),IF(AND($B$9=\"Tous\",$G$8<>\"\"),COUNTIFS(Registre_IST!$C:$C,Rap_Mens!$B$8,Registre_IST!$O:$O,Rap_Mens!$A18,Registre_IST!$G:$G,Rap_Mens!$D$11,Registre_IST!$I:$I,Rap_Mens!D$12,Registre_IST!$X:$X,Rap_Mens!$G$8),IF(AND($B$9=\"Tous\",$G$8=\"\"),COUNTIFS(Registre_IST!$C:$C,Rap_Mens!$B$8,Registre_IST!$O:$O,Rap_Mens!$A18,Registre_IST!$G:$G,Rap_Mens!$D$11,Registre_IST!$I:$I,Rap_Mens!D$12),IF(AND($B$9<>\"Tous\",$G$8=\"\"),COUNTIFS(Registre_IST!$C:$C,Rap_Mens!$B$8,Registre_IST!$L:$L,Rap_Mens!$B$9,Registre_IST!$O:$O,Rap_Mens!$A18,Registre_IST!$G:$G,Rap_Mens!$D$11,Registre_IST!$I:$I,Rap_Mens!D$12)))))","v":0},{"$f":"IF(AND($B$9<>\"Tous\",$G$8<>\"\"),COUNTIFS(Registre_IST!$C:$C,Rap_Mens!$B$8,Registre_IST!$L:$L,Rap_Mens!$B$9,Registre_IST!$O:$O,Rap_Mens!$A18,Registre_IST!$G:$G,Rap_Mens!$D$11,Registre_IST!$I:$I,Rap_Mens!E$12,Registre_IST!$X:$X,Rap_Mens!$G$8),IF(AND($B$9=\"Tous\",$G$8<>\"\"),COUNTIFS(Registre_IST!$C:$C,Rap_Mens!$B$8,Registre_IST!$O:$O,Rap_Mens!$A18,Registre_IST!$G:$G,Rap_Mens!$D$11,Registre_IST!$I:$I,Rap_Mens!E$12,Registre_IST!$X:$X,Rap_Mens!$G$8),IF(AND($B$9=\"Tous\",$G$8=\"\"),COUNTIFS(Registre_IST!$C:$C,Rap_Mens!$B$8,Registre_IST!$O:$O,Rap_Mens!$A18,Registre_IST!$G:$G,Rap_Mens!$D$11,Registre_IST!$I:$I,Rap_Mens!E$12),IF(AND($B$9<>\"Tous\",$G$8=\"\"),COUNTIFS(Registre_IST!$C:$C,Rap_Mens!$B$8,Registre_IST!$L:$L,Rap_Mens!$B$9,Registre_IST!$O:$O,Rap_Mens!$A18,Registre_IST!$G:$G,Rap_Mens!$D$11,Registre_IST!$I:$I,Rap_Mens!E$12)))))","v":0},{"$f":"IF(AND($B$9<>\"Tous\",$G$8<>\"\"),COUNTIFS(Registre_IST!$C:$C,Rap_Mens!$B$8,Registre_IST!$L:$L,Rap_Mens!$B$9,Registre_IST!$O:$O,Rap_Mens!$A18,Registre_IST!$G:$G,Rap_Mens!$F$11,Registre_IST!$I:$I,Rap_Mens!F$12,Registre_IST!$X:$X,Rap_Mens!$G$8),IF(AND($B$9=\"Tous\",$G$8<>\"\"),COUNTIFS(Registre_IST!$C:$C,Rap_Mens!$B$8,Registre_IST!$O:$O,Rap_Mens!$A18,Registre_IST!$G:$G,Rap_Mens!$F$11,Registre_IST!$I:$I,Rap_Mens!F$12,Registre_IST!$X:$X,Rap_Mens!$G$8),IF(AND($B$9=\"Tous\",$G$8=\"\"),COUNTIFS(Registre_IST!$C:$C,Rap_Mens!$B$8,Registre_IST!$O:$O,Rap_Mens!$A18,Registre_IST!$G:$G,Rap_Mens!$F$11,Registre_IST!$I:$I,Rap_Mens!F$12),IF(AND($B$9<>\"Tous\",$G$8=\"\"),COUNTIFS(Registre_IST!$C:$C,Rap_Mens!$B$8,Registre_IST!$L:$L,Rap_Mens!$B$9,Registre_IST!$O:$O,Rap_Mens!$A18,Registre_IST!$G:$G,Rap_Mens!$F$11,Registre_IST!$I:$I,Rap_Mens!F$12)))))","v":0},{"$f":"IF(AND($B$9<>\"Tous\",$G$8<>\"\"),COUNTIFS(Registre_IST!$C:$C,Rap_Mens!$B$8,Registre_IST!$L:$L,Rap_Mens!$B$9,Registre_IST!$O:$O,Rap_Mens!$A18,Registre_IST!$G:$G,Rap_Mens!$F$11,Registre_IST!$I:$I,Rap_Mens!G$12,Registre_IST!$X:$X,Rap_Mens!$G$8),IF(AND($B$9=\"Tous\",$G$8<>\"\"),COUNTIFS(Registre_IST!$C:$C,Rap_Mens!$B$8,Registre_IST!$O:$O,Rap_Mens!$A18,Registre_IST!$G:$G,Rap_Mens!$F$11,Registre_IST!$I:$I,Rap_Mens!G$12,Registre_IST!$X:$X,Rap_Mens!$G$8),IF(AND($B$9=\"Tous\",$G$8=\"\"),COUNTIFS(Registre_IST!$C:$C,Rap_Mens!$B$8,Registre_IST!$O:$O,Rap_Mens!$A18,Registre_IST!$G:$G,Rap_Mens!$F$11,Registre_IST!$I:$I,Rap_Mens!G$12),IF(AND($B$9<>\"Tous\",$G$8=\"\"),COUNTIFS(Registre_IST!$C:$C,Rap_Mens!$B$8,Registre_IST!$L:$L,Rap_Mens!$B$9,Registre_IST!$O:$O,Rap_Mens!$A18,Registre_IST!$G:$G,Rap_Mens!$F$11,Registre_IST!$I:$I,Rap_Mens!G$12)))))","v":0},{"$f":"IF(AND($B$9<>\"Tous\",$G$8<>\"\"),COUNTIFS(Registre_IST!$C:$C,Rap_Mens!$B$8,Registre_IST!$L:$L,Rap_Mens!$B$9,Registre_IST!$O:$O,Rap_Mens!$A18,Registre_IST!$G:$G,Rap_Mens!$H$11,Registre_IST!$I:$I,Rap_Mens!H$12,Registre_IST!$X:$X,Rap_Mens!$G$8),IF(AND($B$9=\"Tous\",$G$8<>\"\"),COUNTIFS(Registre_IST!$C:$C,Rap_Mens!$B$8,Registre_IST!$O:$O,Rap_Mens!$A18,Registre_IST!$G:$G,Rap_Mens!$H$11,Registre_IST!$I:$I,Rap_Mens!H$12,Registre_IST!$X:$X,Rap_Mens!$G$8),IF(AND($B$9=\"Tous\",$G$8=\"\"),COUNTIFS(Registre_IST!$C:$C,Rap_Mens!$B$8,Registre_IST!$O:$O,Rap_Mens!$A18,Registre_IST!$G:$G,Rap_Mens!$H$11,Registre_IST!$I:$I,Rap_Mens!H$12),IF(AND($B$9<>\"Tous\",$G$8=\"\"),COUNTIFS(Registre_IST!$C:$C,Rap_Mens!$B$8,Registre_IST!$L:$L,Rap_Mens!$B$9,Registre_IST!$O:$O,Rap_Mens!$A18,Registre_IST!$G:$G,Rap_Mens!$H$11,Registre_IST!$I:$I,Rap_Mens!H$12)))))","v":0},{"$f":"IF(AND($B$9<>\"Tous\",$G$8<>\"\"),COUNTIFS(Registre_IST!$C:$C,Rap_Mens!$B$8,Registre_IST!$L:$L,Rap_Mens!$B$9,Registre_IST!$O:$O,Rap_Mens!$A18,Registre_IST!$G:$G,Rap_Mens!$H$11,Registre_IST!$I:$I,Rap_Mens!I$12,Registre_IST!$X:$X,Rap_Mens!$G$8),IF(AND($B$9=\"Tous\",$G$8<>\"\"),COUNTIFS(Registre_IST!$C:$C,Rap_Mens!$B$8,Registre_IST!$O:$O,Rap_Mens!$A18,Registre_IST!$G:$G,Rap_Mens!$H$11,Registre_IST!$I:$I,Rap_Mens!I$12,Registre_IST!$X:$X,Rap_Mens!$G$8),IF(AND($B$9=\"Tous\",$G$8=\"\"),COUNTIFS(Registre_IST!$C:$C,Rap_Mens!$B$8,Registre_IST!$O:$O,Rap_Mens!$A18,Registre_IST!$G:$G,Rap_Mens!$H$11,Registre_IST!$I:$I,Rap_Mens!I$12),IF(AND($B$9<>\"Tous\",$G$8=\"\"),COUNTIFS(Registre_IST!$C:$C,Rap_Mens!$B$8,Registre_IST!$L:$L,Rap_Mens!$B$9,Registre_IST!$O:$O,Rap_Mens!$A18,Registre_IST!$G:$G,Rap_Mens!$H$11,Registre_IST!$I:$I,Rap_Mens!I$12)))))","v":0},{"$f":"IF(AND($B$9<>\"Tous\",$G$8<>\"\"),COUNTIFS(Registre_IST!$C:$C,Rap_Mens!$B$8,Registre_IST!$L:$L,Rap_Mens!$B$9,Registre_IST!$O:$O,Rap_Mens!$A18,Registre_IST!$G:$G,Rap_Mens!$J$11,Registre_IST!$I:$I,Rap_Mens!J$12,Registre_IST!$X:$X,Rap_Mens!$G$8),IF(AND($B$9=\"Tous\",$G$8<>\"\"),COUNTIFS(Registre_IST!$C:$C,Rap_Mens!$B$8,Registre_IST!$O:$O,Rap_Mens!$A18,Registre_IST!$G:$G,Rap_Mens!$J$11,Registre_IST!$I:$I,Rap_Mens!J$12,Registre_IST!$X:$X,Rap_Mens!$G$8),IF(AND($B$9=\"Tous\",$G$8=\"\"),COUNTIFS(Registre_IST!$C:$C,Rap_Mens!$B$8,Registre_IST!$O:$O,Rap_Mens!$A18,Registre_IST!$G:$G,Rap_Mens!$J$11,Registre_IST!$I:$I,Rap_Mens!J$12),IF(AND($B$9<>\"Tous\",$G$8=\"\"),COUNTIFS(Registre_IST!$C:$C,Rap_Mens!$B$8,Registre_IST!$L:$L,Rap_Mens!$B$9,Registre_IST!$O:$O,Rap_Mens!$A18,Registre_IST!$G:$G,Rap_Mens!$J$11,Registre_IST!$I:$I,Rap_Mens!J$12)))))","v":0},{"$f":"IF(AND($B$9<>\"Tous\",$G$8<>\"\"),COUNTIFS(Registre_IST!$C:$C,Rap_Mens!$B$8,Registre_IST!$L:$L,Rap_Mens!$B$9,Registre_IST!$O:$O,Rap_Mens!$A18,Registre_IST!$G:$G,Rap_Mens!$J$11,Registre_IST!$I:$I,Rap_Mens!K$12,Registre_IST!$X:$X,Rap_Mens!$G$8),IF(AND($B$9=\"Tous\",$G$8<>\"\"),COUNTIFS(Registre_IST!$C:$C,Rap_Mens!$B$8,Registre_IST!$O:$O,Rap_Mens!$A18,Registre_IST!$G:$G,Rap_Mens!$J$11,Registre_IST!$I:$I,Rap_Mens!K$12,Registre_IST!$X:$X,Rap_Mens!$G$8),IF(AND($B$9=\"Tous\",$G$8=\"\"),COUNTIFS(Registre_IST!$C:$C,Rap_Mens!$B$8,Registre_IST!$O:$O,Rap_Mens!$A18,Registre_IST!$G:$G,Rap_Mens!$J$11,Registre_IST!$I:$I,Rap_Mens!K$12),IF(AND($B$9<>\"Tous\",$G$8=\"\"),COUNTIFS(Registre_IST!$C:$C,Rap_Mens!$B$8,Registre_IST!$L:$L,Rap_Mens!$B$9,Registre_IST!$O:$O,Rap_Mens!$A18,Registre_IST!$G:$G,Rap_Mens!$J$11,Registre_IST!$I:$I,Rap_Mens!K$12)))))","v":0}]
["Total",{"$f":"SUM(B13:B18)","v":0},{"$f":"SUM(C13:C18)","v":0},0,0,0,0,0,0,0,0]
[]
[]
[]
[null,null,null,null,null,null,null,"Signé par :"]
[]
[]
[]
[null,null,null,null,null,null,null,"Qualité :"]

{"sheet":"Rap_Sem","index":7,"n_rows":27,"n_cols":11,"rows_kept":27,"cut":false,"hidden":true,"merged":[[10,7,10,8],[10,9,10,10],[1,2,1,3],[2,2,2,3],[3,2,3,3],[10,1,10,2],[10,3,10,4],[10,5,10,6]]}
["Association de Lutte Contre le Sida"]
["Section",null,{"$f":"IF(Accueil!$D$9<>\"\",Accueil!$D$9,\"\")","v":""}]
["Année",null,{"$f":"IF(Accueil!$D$10<>\"\",Accueil!$D$10,\"\")","v":""}]
["CIDAG",null,{"$f":"IF(Accueil!$D$11<>\"\",Accueil!$D$11,\"\")","v":""}]
[]
["Consultation IST"]
[]
["Période","Semestre 1",null,null,null,"Stratégie","Fixe"]
["Bénéficiaires","Tous"]
[]
[null,"15-19",null,"20-29",null,"30-39",null,"40-49",null,"50et+"]
[null,"M","F","M","F","M","F","M","F","M","F"]
["Ecoul. Urétral",{"$f":"IF(AND($B$9<>\"Tous\",$G$8<>\"\"),COUNTIFS(Registre_IST!$AA:$AA,Rap_Sem!$B$8,Registre_IST!$L:$L,Rap_Sem!$B$9,Registre_IST!$O:$O,Rap_Sem!$A13,Registre_IST!$G:$G,Rap_Sem!$B$11,Registre_IST!$I:$I,Rap_Sem!B$12,Registre_IST!$X:$X,Rap_Sem!$G$8),IF(AND($B$9=\"Tous\",$G$8<>\"\"),COUNTIFS(Registre_IST!$AA:$AA,Rap_Sem!$B$8,Registre_IST!$O:$O,Rap_Sem!$A13,Registre_IST!$G:$G,Rap_Sem!$B$11,Registre_IST!$I:$I,Rap_Sem!B$12,Registre_IST!$X:$X,Rap_Sem!$G$8),IF(AND($B$9=\"Tous\",$G$8=\"\"),COUNTIFS(Registre_IST!$AA:$AA,Rap_Sem!$B$8,Registre_IST!$O:$O,Rap_Sem!$A13,Registre_IST!$G:$G,Rap_Sem!$B$11,Registre_IST!$I:$I,Rap_Sem!B$12),IF(AND($B$9<>\"Tous\",$G$8=\"\"),COUNTIFS(Registre_IST!$AA:$AA,Rap_Sem!$B$8,Registre_IST!$L:$L,Rap_Sem!$B$9,Registre_IST!$O:$O,Rap_Sem!$A13,Registre_IST!$G:$G,Rap_Sem!$B$11,Registre_IST!$I:$I,Rap_Sem!B$12)))))","v":0},{"$f":"IF(AND($B$9<>\"Tous\",$G$8<>\"\"),COUNTIFS(Registre_IST!$AA:$AA,Rap_Sem!$B$8,Registre_IST!$L:$L,Rap_Sem!$B$9,Registre_IST!$O:$O,Rap_Sem!$A13,Registre_IST!$G:$G,Rap_Sem!$B$11,Registre_IST!$I:$I,Rap_Sem!C$12,Registre_IST!$X:$X,Rap_Sem!$G$8),IF(AND($B$9=\"Tous\",$G$8<>\"\"),COUNTIFS(Registre_IST!$AA:$AA,Rap_Sem!$B$8,Registre_IST!$O:$O,Rap_Sem!$A13,Registre_IST!$G:$G,Rap_Sem!$B$11,Registre_IST!$I:$I,Rap_Sem!C$12,Registre_IST!$X:$X,Rap_Sem!$G$8),IF(AND($B$9=\"Tous\",$G$8=\"\"),COUNTIFS(Registre_IST!$AA:$AA,Rap_Sem!$B$8,Registre_IST!$O:$O,Rap_Sem!$A13,Registre_IST!$G:$G,Rap_Sem!$B$11,Registre_IST!$I:$I,Rap_Sem!C$12),IF(AND($B$9<>\"Tous\",$G$8=\"\"),COUNTIFS(Registre_IST!$AA:$AA,Rap_Sem!$B$8,Registre_IST!$L:$L,Rap_Sem!$B$9,Registre_IST!$O:$O,Rap_Sem!$A13,Registre_IST!$G:$G,Rap_Sem!$B$11,Registre_IST!$I:$I,Rap_Sem!C$12)))))","v":0},{"$f":"IF(AND($B$9<>\"Tous\",$G$8<>\"\"),COUNTIFS(Registre_IST!$AA:$AA,Rap_Sem!$B$8,Registre_IST!$L:$L,Rap_Sem!$B$9,Registre_IST!$O:$O,Rap_Sem!$A13,Registre_IST!$G:$G,Rap_Sem!$D$11,Registre_IST!$I:$I,Rap_Sem!D$12,Registre_IST!$X:$X,Rap_Sem!$G$8),IF(AND($B$9=\"Tous\",$G$8<>\"\"),COUNTIFS(Registre_IST!$AA:$AA,Rap_Sem!$B$8,Registre_IST!$O:$O,Rap_Sem!$A13,Registre_IST!$G:$G,Rap_Sem!$D$11,Registre_IST!$I:$I,Rap_Sem!D$12,Registre_IST!$X:$X,Rap_Sem!$G$8),IF(AND($B$9=\"Tous\",$G$8=\"\"),COUNTIFS(Registre_IST!$AA:$AA,Rap_Sem!$B$8,Registre_IST!$O:$O,Rap_Sem!$A13,Registre_IST!$G:$G,Rap_Sem!$D$11,Registre_IST!$I:$I,Rap_Sem!D$12),IF(AND($B$9<>\"Tous\",$G$8=\"\"),COUNTIFS(Registre_IST!$AA:$AA,Rap_Sem!$B$8,Registre_IST!$L:$L,Rap_Sem!$B$9,Registre_IST!$O:$O,Rap_Sem!$A13,Registre_IST!$G:$G,Rap_Sem!$D$11,Registre_IST!$I:$I,Rap_Sem!D$12)))))","v":0},{"$f":"IF(AND($B$9<>\"Tous\",$G$8<>\"\"),COUNTIFS(Registre_IST!$AA:$AA,Rap_Sem!$B$8,Registre_IST!$L:$L,Rap_Sem!$B$9,Registre_IST!$O:$O,Rap_Sem!$A13,Registre_IST!$G:$G,Rap_Sem!$D$11,Registre_IST!$I:$I,Rap_Sem!E$12,Registre_IST!$X:$X,Rap_Sem!$G$8),IF(AND($B$9=\"Tous\",$G$8<>\"\"),COUNTIFS(Registre_IST!$AA:$AA,Rap_Sem!$B$8,Registre_IST!$O:$O,Rap_Sem!$A13,Registre_IST!$G:$G,Rap_Sem!$D$11,Registre_IST!$I:$I,Rap_Sem!E$12,Registre_IST!$X:$X,Rap_Sem!$G$8),IF(AND($B$9=\"Tous\",$G$8=\"\"),COUNTIFS(Registre_IST!$AA:$AA,Rap_Sem!$B$8,Registre_IST!$O:$O,Rap_Sem!$A13,Registre_IST!$G:$G,Rap_Sem!$D$11,Registre_IST!$I:$I,Rap_Sem!E$12),IF(AND($B$9<>\"Tous\",$G$8=\"\"),COUNTIFS(Registre_IST!$AA:$AA,Rap_Sem!$B$8,Registre_IST!$L:$L,Rap_Sem!$B$9,Registre_IST!$O:$O,Rap_Sem!$A13,Registre_IST!$G:$G,Rap_Sem!$D$11,Registre_IST!$I:$I,Rap_Sem!E$12)))))","v":0},{"$f":"IF(AND($B$9<>\"Tous\",$G$8<>\"\"),COUNTIFS(Registre_IST!$AA:$AA,Rap_Sem!$B$8,Registre_IST!$L:$L,Rap_Sem!$B$9,Registre_IST!$O:$O,Rap_Sem!$A13,Registre_IST!$G:$G,Rap_Sem!$F$11,Registre_IST!$I:$I,Rap_Sem!F$12,Registre_IST!$X:$X,Rap_Sem!$G$8),IF(AND($B$9=\"Tous\",$G$8<>\"\"),COUNTIFS(Registre_IST!$AA:$AA,Rap_Sem!$B$8,Registre_IST!$O:$O,Rap_Sem!$A13,Registre_IST!$G:$G,Rap_Sem!$F$11,Registre_IST!$I:$I,Rap_Sem!F$12,Registre_IST!$X:$X,Rap_Sem!$G$8),IF(AND($B$9=\"Tous\",$G$8=\"\"),COUNTIFS(Registre_IST!$AA:$AA,Rap_Sem!$B$8,Registre_IST!$O:$O,Rap_Sem!$A13,Registre_IST!$G:$G,Rap_Sem!$F$11,Registre_IST!$I:$I,Rap_Sem!F$12),IF(AND($B$9<>\"Tous\",$G$8=\"\"),COUNTIFS(Registre_IST!$AA:$AA,Rap_Sem!$B$8,Registre_IST!$L:$L,Rap_Sem!$B$9,Registre_IST!$O:$O,Rap_Sem!$A13,Registre_IST!$G:$G,Rap_Sem!$F$11,Registre_IST!$I:$I,Rap_Sem!F$12)))))","v":0},{"$f":"IF(AND($B$9<>\"Tous\",$G$8<>\"\"),COUNTIFS(Registre_IST!$AA:$AA,Rap_Sem!$B$8,Registre_IST!$L:$L,Rap_Sem!$B$9,Registre_IST!$O:$O,Rap_Sem!$A13,Registre_IST!$G:$G,Rap_Sem!$F$11,Registre_IST!$I:$I,Rap_Sem!G$12,Registre_IST!$X:$X,Rap_Sem!$G$8),IF(AND($B$9=\"Tous\",$G$8<>\"\"),COUNTIFS(Registre_IST!$AA:$AA,Rap_Sem!$B$8,Registre_IST!$O:$O,Rap_Sem!$A13,Registre_IST!$G:$G,Rap_Sem!$F$11,Registre_IST!$I:$I,Rap_Sem!G$12,Registre_IST!$X:$X,Rap_Sem!$G$8),IF(AND($B$9=\"Tous\",$G$8=\"\"),COUNTIFS(Registre_IST!$AA:$AA,Rap_Sem!$B$8,Registre_IST!$O:$O,Rap_Sem!$A13,Registre_IST!$G:$G,Rap_Sem!$F$11,Registre_IST!$I:$I,Rap_Sem!G$12),IF(AND($B$9<>\"Tous\",$G$8=\"\"),COUNTIFS(Registre_IST!$AA:$AA,Rap_Sem!$B$8,Registre_IST!$L:$L,Rap_Sem!$B$9,Registre_IST!$O:$O,Rap_Sem!$A13,Registre_IST!$G:$G,Rap_Sem!$F$11,Registre_IST!$I:$I,Rap_Sem!G$12)))))","v":0},{"$f":"IF(AND($B$9<>\"Tous\",$G$8<>\"\"),COUNTIFS(Registre_IST!$AA:$AA,Rap_Sem!$B$8,Registre_IST!$L:$L,Rap_Sem!$B$9,Registre_IST!$O:$O,Rap_Sem!$A13,Registre_IST!$G:$G,Rap_Sem!$H$11,Registre_IST!$I:$I,Rap_Sem!H$12,Registre_IST!$X:$X,Rap_Sem!$G$8),IF(AND($B$9=\"Tous\",$G$8<>\"\"),COUNTIFS(Registre_IST!$AA:$AA,Rap_Sem!$B$8,Registre_IST!$O:$O,Rap_Sem!$A13,Registre_IST!$G:$G,Rap_Sem!$H$11,Registre_IST!$I:$I,Rap_Sem!H$12,Registre_IST!$X:$X,Rap_Sem!$G$8),IF(AND($B$9=\"Tous\",$G$8=\"\"),COUNTIFS(Registre_IST!$AA:$AA,Rap_Sem!$B$8,Registre_IST!$O:$O,Rap_Sem!$A13,Registre_IST!$G:$G,Rap_Sem!$H$11,Registre_IST!$I:$I,Rap_Sem!H$12),IF(AND($B$9<>\"Tous\",$G$8=\"\"),COUNTIFS(Registre_IST!$AA:$AA,Rap_Sem!$B$8,Registre_IST!$L:$L,Rap_Sem!$B$9,Registre_IST!$O:$O,Rap_Sem!$A13,Registre_IST!$G:$G,Rap_Sem!$H$11,Registre_IST!$I:$I,Rap_Sem!H$12)))))","v":0},{"$f":"IF(AND($B$9<>\"Tous\",$G$8<>\"\"),COUNTIFS(Registre_IST!$AA:$AA,Rap_Sem!$B$8,Registre_IST!$L:$L,Rap_Sem!$B$9,Registre_IST!$O:$O,Rap_Sem!$A13,Registre_IST!$G:$G,Rap_Sem!$H$11,Registre_IST!$I:$I,Rap_Sem!I$12,Registre_IST!$X:$X,Rap_Sem!$G$8),IF(AND($B$9=\"Tous\",$G$8<>\"\"),COUNTIFS(Registre_IST!$AA:$AA,Rap_Sem!$B$8,Registre_IST!$O:$O,Rap_Sem!$A13,Registre_IST!$G:$G,Rap_Sem!$H$11,Registre_IST!$I:$I,Rap_Sem!I$12,Registre_IST!$X:$X,Rap_Sem!$G$8),IF(AND($B$9=\"Tous\",$G$8=\"\"),COUNTIFS(Registre_IST!$AA:$AA,Rap_Sem!$B$8,Registre_IST!$O:$O,Rap_Sem!$A13,Registre_IST!$G:$G,Rap_Sem!$H$11,Registre_IST!$I:$I,Rap_Sem!I$12),IF(AND($B$9<>\"Tous\",$G$8=\"\"),COUNTIFS(Registre_IST!$AA:$AA,Rap_Sem!$B$8,Registre_IST!$L:$L,Rap_Sem!$B$9,Registre_IST!$O:$O,Rap_Sem!$A13,Registre_IST!$G:$G,Rap_Sem!$H$11,Registre_IST!$I:$I,Rap_Sem!I$12)))))","v":0},{"$f":"IF(AND($B$9<>\"Tous\",$G$8<>\"\"),COUNTIFS(Registre_IST!$AA:$AA,Rap_Sem!$B$8,Registre_IST!$L:$L,Rap_Sem!$B$9,Registre_IST!$O:$O,Rap_Sem!$A13,Registre_IST!$G:$G,Rap_Sem!$J$11,Registre_IST!$I:$I,Rap_Sem!J$12,Registre_IST!$X:$X,Rap_Sem!$G$8),IF(AND($B$9=\"Tous\",$G$8<>\"\"),COUNTIFS(Registre_IST!$AA:$AA,Rap_Sem!$B$8,Registre_IST!$O:$O,Rap_Sem!$A13,Registre_IST!$G:$G,Rap_Sem!$J$11,Registre_IST!$I:$I,Rap_Sem!J$12,Registre_IST!$X:$X,Rap_Sem!$G$8),IF(AND($B$9=\"Tous\",$G$8=\"\"),COUNTIFS(Registre_IST!$AA:$AA,Rap_Sem!$B$8,Registre_IST!$O:$O,Rap_Sem!$A13,Registre_IST!$G:$G,Rap_Sem!$J$11,Registre_IST!$I:$I,Rap_Sem!J$12),IF(AND($B$9<>\"Tous\",$G$8=\"\"),COUNTIFS(Registre_IST!$AA:$AA,Rap_Sem!$B$8,Registre_IST!$L:$L,Rap_Sem!$B$9,Registre_IST!$O:$O,Rap_Sem!$A13,Registre_IST!$G:$G,Rap_Sem!$J$11,Registre_IST!$I:$I,Rap_Sem!J$12)))))","v":0},{"$f":"IF(AND($B$9<>\"Tous\",$G$8<>\"\"),COUNTIFS(Registre_IST!$AA:$AA,Rap_Sem!$B$8,Registre_IST!$L:$L,Rap_Sem!$B$9,Registre_IST!$O:$O,Rap_Sem!$A13,Registre_IST!$G:$G,Rap_Sem!$J$11,Registre_IST!$I:$I,Rap_Sem!K$12,Registre_IST!$X:$X,Rap_Sem!$G$8),IF(AND($B$9=\"Tous\",$G$8<>\"\"),COUNTIFS(Registre_IST!$AA:$AA,Rap_Sem!$B$8,Registre_IST!$O:$O,Rap_Sem!$A13,Registre_IST!$G:$G,Rap_Sem!$J$11,Registre_IST!$I:$I,Rap_Sem!K$12,Registre_IST!$X:$X,Rap_Sem!$G$8),IF(AND($B$9=\"Tous\",$G$8=\"\"),COUNTIFS(Registre_IST!$AA:$AA,Rap_Sem!$B$8,Registre_IST!$O:$O,Rap_Sem!$A13,Registre_IST!$G:$G,Rap_Sem!$J$11,Registre_IST!$I:$I,Rap_Sem!K$12),IF(AND($B$9<>\"Tous\",$G$8=\"\"),COUNTIFS(Registre_IST!$AA:$AA,Rap_Sem!$B$8,Registre_IST!$L:$L,Rap_Sem!$B$9,Registre_IST!$O:$O,Rap_Sem!$A13,Registre_IST!$G:$G,Rap_Sem!$J$11,Registre_IST!$I:$I,Rap_Sem!K$12)))))","v":0}]
["Vaginite",{"$f":"IF(AND($B$9<>\"Tous\",$G$8<>\"\"),COUNTIFS(Registre_IST!$AA:$AA,Rap_Sem!$B$8,Registre_IST!$L:$L,Rap_Sem!$B$9,Registre_IST!$O:$O,Rap_Sem!$A14,Registre_IST!$G:$G,Rap_Sem!$B$11,Registre_IST!$I:$I,Rap_Sem!B$12,Registre_IST!$X:$X,Rap_Sem!$G$8),IF(AND($B$9=\"Tous\",$G$8<>\"\"),COUNTIFS(Registre_IST!$AA:$AA,Rap_Sem!$B$8,Registre_IST!$O:$O,Rap_Sem!$A14,Registre_IST!$G:$G,Rap_Sem!$B$11,Registre_IST!$I:$I,Rap_Sem!B$12,Registre_IST!$X:$X,Rap_Sem!$G$8),IF(AND($B$9=\"Tous\",$G$8=\"\"),COUNTIFS(Registre_IST!$AA:$AA,Rap_Sem!$B$8,Registre_IST!$O:$O,Rap_Sem!$A14,Registre_IST!$G:$G,Rap_Sem!$B$11,Registre_IST!$I:$I,Rap_Sem!B$12),IF(AND($B$9<>\"Tous\",$G$8=\"\"),COUNTIFS(Registre_IST!$AA:$AA,Rap_Sem!$B$8,Registre_IST!$L:$L,Rap_Sem!$B$9,Registre_IST!$O:$O,Rap_Sem!$A14,Registre_IST!$G:$G,Rap_Sem!$B$11,Registre_IST!$I:$I,Rap_Sem!B$12)))))","v":0},{"$f":"IF(AND($B$9<>\"Tous\",$G$8<>\"\"),COUNTIFS(Registre_IST!$AA:$AA,Rap_Sem!$B$8,Registre_IST!$L:$L,Rap_Sem!$B$9,Registre_IST!$O:$O,Rap_Sem!$A14,Registre_IST!$G:$G,Rap_Sem!$B$11,Registre_IST!$I:$I,Rap_Sem!C$12,Registre_IST!$X:$X,Rap_Sem!$G$8),IF(AND($B$9=\"Tous\",$G$8<>\"\"),COUNTIFS(Registre_IST!$AA:$AA,Rap_Sem!$B$8,Registre_IST!$O:$O,Rap_Sem!$A14,Registre_IST!$G:$G,Rap_Sem!$B$11,Registre_IST!$I:$I,Rap_Sem!C$12,Registre_IST!$X:$X,Rap_Sem!$G$8),IF(AND($B$9=\"Tous\",$G$8=\"\"),COUNTIFS(Registre_IST!$AA:$AA,Rap_Sem!$B$8,Registre_IST!$O:$O,Rap_Sem!$A14,Registre_IST!$G:$G,Rap_Sem!$B$11,Registre_IST!$I:$I,Rap_Sem!C$12),IF(AND($B$9<>\"Tous\",$G$8=\"\"),COUNTIFS(Registre_IST!$AA:$AA,Rap_Sem!$B$8,Registre_IST!$L:$L,Rap_Sem!$B$9,Registre_IST!$O:$O,Rap_Sem!$A14,Registre_IST!$G:$G,Rap_Sem!$B$11,Registre_IST!$I:$I,Rap_Sem!C$12)))))","v":0},{"$f":"IF(AND($B$9<>\"Tous\",$G$8<>\"\"),COUNTIFS(Registre_IST!$AA:$AA,Rap_Sem!$B$8,Registre_IST!$L:$L,Rap_Sem!$B$9,Registre_IST!$O:$O,Rap_Sem!$A14,Registre_IST!$G:$G,Rap_Sem!$D$11,Registre_IST!$I:$I,Rap_Sem!D$12,Registre_IST!$X:$X,Rap_Sem!$G$8),IF(AND($B$9=\"Tous\",$G$8<>\"\"),COUNTIFS(Registre_IST!$AA:$AA,Rap_Sem!$B$8,Registre_IST!$O:$O,Rap_Sem!$A14,Registre_IST!$G:$G,Rap_Sem!$D$11,Registre_IST!$I:$I,Rap_Sem!D$12,Registre_IST!$X:$X,Rap_Sem!$G$8),IF(AND($B$9=\"Tous\",$G$8=\"\"),COUNTIFS(Registre_IST!$AA:$AA,Rap_Sem!$B$8,Registre_IST!$O:$O,Rap_Sem!$A14,Registre_IST!$G:$G,Rap_Sem!$D$11,Registre_IST!$I:$I,Rap_Sem!D$12),IF(AND($B$9<>\"Tous\",$G$8=\"\"),COUNTIFS(Registre_IST!$AA:$AA,Rap_Sem!$B$8,Registre_IST!$L:$L,Rap_Sem!$B$9,Registre_IST!$O:$O,Rap_Sem!$A14,Registre_IST!$G:$G,Rap_Sem!$D$11,Registre_IST!$I:$I,Rap_Sem!D$12)))))","v":0},{"$f":"IF(AND($B$9<>\"Tous\",$G$8<>\"\"),COUNTIFS(Registre_IST!$AA:$AA,Rap_Sem!$B$8,Registre_IST!$L:$L,Rap_Sem!$B$9,Registre_IST!$O:$O,Rap_Sem!$A14,Registre_IST!$G:$G,Rap_Sem!$D$11,Registre_IST!$I:$I,Rap_Sem!E$12,Registre_IST!$X:$X,Rap_Sem!$G$8),IF(AND($B$9=\"Tous\",$G$8<>\"\"),COUNTIFS(Registre_IST!$AA:$AA,Rap_Sem!$B$8,Registre_IST!$O:$O,Rap_Sem!$A14,Registre_IST!$G:$G,Rap_Sem!$D$11,Registre_IST!$I:$I,Rap_Sem!E$12,Registre_IST!$X:$X,Rap_Sem!$G$8),IF(AND($B$9=\"Tous\",$G$8=\"\"),COUNTIFS(Registre_IST!$AA:$AA,Rap_Sem!$B$8,Registre_IST!$O:$O,Rap_Sem!$A14,Registre_IST!$G:$G,Rap_Sem!$D$11,Registre_IST!$I:$I,Rap_Sem!E$12),IF(AND($B$9<>\"Tous\",$G$8=\"\"),COUNTIFS(Registre_IST!$AA:$AA,Rap_Sem!$B$8,Registre_IST!$L:$L,Rap_Sem!$B$9,Registre_IST!$O:$O,Rap_Sem!$A14,Registre_IST!$G:$G,Rap_Sem!$D$11,Registre_IST!$I:$I,Rap_Sem!E$12)))))","v":0},{"$f":"IF(AND($B$9<>\"Tous\",$G$8<>\"\"),COUNTIFS(Registre_IST!$AA:$AA,Rap_Sem!$B$8,Registre_IST!$L:$L,Rap_Sem!$B$9,Registre_IST!$O:$O,Rap_Sem!$A14,Registre_IST!$G:$G,Rap_Sem!$F$11,Registre_IST!$I:$I,Rap_Sem!F$12,Registre_IST!$X:$X,Rap_Sem!$G$8),IF(AND($B$9=\"Tous\",$G$8<>\"\"),COUNTIFS(Registre_IST!$AA:$AA,Rap_Sem!$B$8,Registre_IST!$O:$O,Rap_Sem!$A14,Registre_IST!$G:$G,Rap_Sem!$F$11,Registre_IST!$I:$I,Rap_Sem!F$12,Registre_IST!$X:$X,Rap_Sem!$G$8),IF(AND($B$9=\"Tous\",$G$8=\"\"),COUNTIFS(Registre_IST!$AA:$AA,Rap_Sem!$B$8,Registre_IST!$O:$O,Rap_Sem!$A14,Registre_IST!$G:$G,Rap_Sem!$F$11,Registre_IST!$I:$I,Rap_Sem!F$12),IF(AND($B$9<>\"Tous\",$G$8=\"\"),COUNTIFS(Registre_IST!$AA:$AA,Rap_Sem!$B$8,Registre_IST!$L:$L,Rap_Sem!$B$9,Registre_IST!$O:$O,Rap_Sem!$A14,Registre_IST!$G:$G,Rap_Sem!$F$11,Registre_IST!$I:$I,Rap_Sem!F$12)))))","v":0},{"$f":"IF(AND($B$9<>\"Tous\",$G$8<>\"\"),COUNTIFS(Registre_IST!$AA:$AA,Rap_Sem!$B$8,Registre_IST!$L:$L,Rap_Sem!$B$9,Registre_IST!$O:$O,Rap_Sem!$A14,Registre_IST!$G:$G,Rap_Sem!$F$11,Registre_IST!$I:$I,Rap_Sem!G$12,Registre_IST!$X:$X,Rap_Sem!$G$8),IF(AND($B$9=\"Tous\",$G$8<>\"\"),COUNTIFS(Registre_IST!$AA:$AA,Rap_Sem!$B$8,Registre_IST!$O:$O,Rap_Sem!$A14,Registre_IST!$G:$G,Rap_Sem!$F$11,Registre_IST!$I:$I,Rap_Sem!G$12,Registre_IST!$X:$X,Rap_Sem!$G$8),IF(AND($B$9=\"Tous\",$G$8=\"\"),COUNTIFS(Registre_IST!$AA:$AA,Rap_Sem!$B$8,Registre_IST!$O:$O,Rap_Sem!$A14,Registre_IST!$G:$G,Rap_Sem!$F$11,Registre_IST!$I:$I,Rap_Sem!G$12),IF(AND($B$9<>\"Tous\",$G$8=\"\"),COUNTIFS(Registre_IST!$AA:$AA,Rap_Sem!$B$8,Registre_IST!$L:$L,Rap_Sem!$B$9,Registre_IST!$O:$O,Rap_Sem!$A14,Registre_IST!$G:$G,Rap_Sem!$F$11,Registre_IST!$I:$I,Rap_Sem!G$12)))))","v":0},{"$f":"IF(AND($B$9<>\"Tous\",$G$8<>\"\"),COUNTIFS(Registre_IST!$AA:$AA,Rap_Sem!$B$8,Registre_IST!$L:$L,Rap_Sem!$B$9,Registre_IST!$O:$O,Rap_Sem!$A14,Registre_IST!$G:$G,Rap_Sem!$H$11,Registre_IST!$I:$I,Rap_Sem!H$12,Registre_IST!$X:$X,Rap_Sem!$G$8),IF(AND($B$9=\"Tous\",$G$8<>\"\"),COUNTIFS(Registre_IST!$AA:$AA,Rap_Sem!$B$8,Registre_IST!$O:$O,Rap_Sem!$A14,Registre_IST!$G:$G,Rap_Sem!$H$11,Registre_IST!$I:$I,Rap_Sem!H$12,Registre_IST!$X:$X,Rap_Sem!$G$8),IF(AND($B$9=\"Tous\",$G$8=\"\"),COUNTIFS(Registre_IST!$AA:$AA,Rap_Sem!$B$8,Registre_IST!$O:$O,Rap_Sem!$A14,Registre_IST!$G:$G,Rap_Sem!$H$11,Registre_IST!$I:$I,Rap_Sem!H$12),IF(AND($B$9<>\"Tous\",$G$8=\"\"),COUNTIFS(Registre_IST!$AA:$AA,Rap_Sem!$B$8,Registre_IST!$L:$L,Rap_Sem!$B$9,Registre_IST!$O:$O,Rap_Sem!$A14,Registre_IST!$G:$G,Rap_Sem!$H$11,Registre_IST!$I:$I,Rap_Sem!H$12)))))","v":0},{"$f":"IF(AND($B$9<>\"Tous\",$G$8<>\"\"),COUNTIFS(Registre_IST!$AA:$AA,Rap_Sem!$B$8,Registre_IST!$L:$L,Rap_Sem!$B$9,Registre_IST!$O:$O,Rap_Sem!$A14,Registre_IST!$G:$G,Rap_Sem!$H$11,Registre_IST!$I:$I,Rap_Sem!I$12,Registre_IST!$X:$X,Rap_Sem!$G$8),IF(AND($B$9=\"Tous\",$G$8<>\"\"),COUNTIFS(Registre_IST!$AA:$AA,Rap_Sem!$B$8,Registre_IST!$O:$O,Rap_Sem!$A14,Registre_IST!$G:$G,Rap_Sem!$H$11,Registre_IST!$I:$I,Rap_Sem!I$12,Registre_IST!$X:$X,Rap_Sem!$G$8),IF(AND($B$9=\"Tous\",$G$8=\"\"),COUNTIFS(Registre_IST!$AA:$AA,Rap_Sem!$B$8,Registre_IST!$O:$O,Rap_Sem!$A14,Registre_IST!$G:$G,Rap_Sem!$H$11,Registre_IST!$I:$I,Rap_Sem!I$12),IF(AND($B$9<>\"Tous\",$G$8=\"\"),COUNTIFS(Registre_IST!$AA:$AA,Rap_Sem!$B$8,Registre_IST!$L:$L,Rap_Sem!$B$9,Registre_IST!$O:$O,Rap_Sem!$A14,Registre_IST!$G:$G,Rap_Sem!$H$11,Registre_IST!$I:$I,Rap_Sem!I$12)))))","v":0},{"$f":"IF(AND($B$9<>\"Tous\",$G$8<>\"\"),COUNTIFS(Registre_IST!$AA:$AA,Rap_Sem!$B$8,Registre_IST!$L:$L,Rap_Sem!$B$9,Registre_IST!$O:$O,Rap_Sem!$A14,Registre_IST!$G:$G,Rap_Sem!$J$11,Registre_IST!$I:$I,Rap_Sem!J$12,Registre_IST!$X:$X,Rap_Sem!$G$8),IF(AND($B$9=\"Tous\",$G$8<>\"\"),COUNTIFS(Registre_IST!$AA:$AA,Rap_Sem!$B$8,Registre_IST!$O:$O,Rap_Sem!$A14,Registre_IST!$G:$G,Rap_Sem!$J$11,Registre_IST!$I:$I,Rap_Sem!J$12,Registre_IST!$X:$X,Rap_Sem!$G$8),IF(AND($B$9=\"Tous\",$G$8=\"\"),COUNTIFS(Registre_IST!$AA:$AA,Rap_Sem!$B$8,Registre_IST!$O:$O,Rap_Sem!$A14,Registre_IST!$G:$G,Rap_Sem!$J$11,Registre_IST!$I:$I,Rap_Sem!J$12),IF(AND($B$9<>\"Tous\",$G$8=\"\"),COUNTIFS(Registre_IST!$AA:$AA,Rap_Sem!$B$8,Registre_IST!$L:$L,Rap_Sem!$B$9,Registre_IST!$O:$O,Rap_Sem!$A14,Registre_IST!$G:$G,Rap_Sem!$J$11,Registre_IST!$I:$I,Rap_Sem!J$12)))))","v":0},{"$f":"IF(AND($B$9<>\"Tous\",$G$8<>\"\"),COUNTIFS(Registre_IST!$AA:$AA,Rap_Sem!$B$8,Registre_IST!$L:$L,Rap_Sem!$B$9,Registre_IST!$O:$O,Rap_Sem!$A14,Registre_IST!$G:$G,Rap_Sem!$J$11,Registre_IST!$I:$I,Rap_Sem!K$12,Registre_IST!$X:$X,Rap_Sem!$G$8),IF(AND($B$9=\"Tous\",$G$8<>\"\"),COUNTIFS(Registre_IST!$AA:$AA,Rap_Sem!$B$8,Registre_IST!$O:$O,Rap_Sem!$A14,Registre_IST!$G:$G,Rap_Sem!$J$11,Registre_IST!$I:$I,Rap_Sem!K$12,Registre_IST!$X:$X,Rap_Sem!$G$8),IF(AND($B$9=\"Tous\",$G$8=\"\"),COUNTIFS(Registre_IST!$AA:$AA,Rap_Sem!$B$8,Registre_IST!$O:$O,Rap_Sem!$A14,Registre_IST!$G:$G,Rap_Sem!$J$11,Registre_IST!$I:$I,Rap_Sem!K$12),IF(AND($B$9<>\"Tous\",$G$8=\"\"),COUNTIFS(Registre_IST!$AA:$AA,Rap_Sem!$B$8,Registre_IST!$L:$L,Rap_Sem!$B$9,Registre_IST!$O:$O,Rap_Sem!$A14,Registre_IST!$G:$G,Rap_Sem!$J$11,Registre_IST!$I:$I,Rap_Sem!K$12)))))","v":0}]
["Cervicite",{"$f":"IF(AND($B$9<>\"Tous\",$G$8<>\"\"),COUNTIFS(Registre_IST!$AA:$AA,Rap_Sem!$B$8,Registre_IST!$L:$L,Rap_Sem!$B$9,Registre_IST!$O:$O,Rap_Sem!$A15,Registre_IST!$G:$G,Rap_Sem!$B$11,Registre_IST!$I:$I,Rap_Sem!B$12,Registre_IST!$X:$X,Rap_Sem!$G$8),IF(AND($B$9=\"Tous\",$G$8<>\"\"),COUNTIFS(Registre_IST!$AA:$AA,Rap_Sem!$B$8,Registre_IST!$O:$O,Rap_Sem!$A15,Registre_IST!$G:$G,Rap_Sem!$B$11,Registre_IST!$I:$I,Rap_Sem!B$12,Registre_IST!$X:$X,Rap_Sem!$G$8),IF(AND($B$9=\"Tous\",$G$8=\"\"),COUNTIFS(Registre_IST!$AA:$AA,Rap_Sem!$B$8,Registre_IST!$O:$O,Rap_Sem!$A15,Registre_IST!$G:$G,Rap_Sem!$B$11,Registre_IST!$I:$I,Rap_Sem!B$12),IF(AND($B$9<>\"Tous\",$G$8=\"\"),COUNTIFS(Registre_IST!$AA:$AA,Rap_Sem!$B$8,Registre_IST!$L:$L,Rap_Sem!$B$9,Registre_IST!$O:$O,Rap_Sem!$A15,Registre_IST!$G:$G,Rap_Sem!$B$11,Registre_IST!$I:$I,Rap_Sem!B$12)))))","v":0},{"$f":"IF(AND($B$9<>\"Tous\",$G$8<>\"\"),COUNTIFS(Registre_IST!$AA:$AA,Rap_Sem!$B$8,Registre_IST!$L:$L,Rap_Sem!$B$9,Registre_IST!$O:$O,Rap_Sem!$A15,Registre_IST!$G:$G,Rap_Sem!$B$11,Registre_IST!$I:$I,Rap_Sem!C$12,Registre_IST!$X:$X,Rap_Sem!$G$8),IF(AND($B$9=\"Tous\",$G$8<>\"\"),COUNTIFS(Registre_IST!$AA:$AA,Rap_Sem!$B$8,Registre_IST!$O:$O,Rap_Sem!$A15,Registre_IST!$G:$G,Rap_Sem!$B$11,Registre_IST!$I:$I,Rap_Sem!C$12,Registre_IST!$X:$X,Rap_Sem!$G$8),IF(AND($B$9=\"Tous\",$G$8=\"\"),COUNTIFS(Registre_IST!$AA:$AA,Rap_Sem!$B$8,Registre_IST!$O:$O,Rap_Sem!$A15,Registre_IST!$G:$G,Rap_Sem!$B$11,Registre_IST!$I:$I,Rap_Sem!C$12),IF(AND($B$9<>\"Tous\",$G$8=\"\"),COUNTIFS(Registre_IST!$AA:$AA,Rap_Sem!$B$8,Registre_IST!$L:$L,Rap_Sem!$B$9,Registre_IST!$O:$O,Rap_Sem!$A15,Registre_IST!$G:$G,Rap_Sem!$B$11,Registre_IST!$I:$I,Rap_Sem!C$12)))))","v":0},{"$f":"IF(AND($B$9<>\"Tous\",$G$8<>\"\"),COUNTIFS(Registre_IST!$AA:$AA,Rap_Sem!$B$8,Registre_IST!$L:$L,Rap_Sem!$B$9,Registre_IST!$O:$O,Rap_Sem!$A15,Registre_IST!$G:$G,Rap_Sem!$D$11,Registre_IST!$I:$I,Rap_Sem!D$12,Registre_IST!$X:$X,Rap_Sem!$G$8),IF(AND($B$9=\"Tous\",$G$8<>\"\"),COUNTIFS(Registre_IST!$AA:$AA,Rap_Sem!$B$8,Registre_IST!$O:$O,Rap_Sem!$A15,Registre_IST!$G:$G,Rap_Sem!$D$11,Registre_IST!$I:$I,Rap_Sem!D$12,Registre_IST!$X:$X,Rap_Sem!$G$8),IF(AND($B$9=\"Tous\",$G$8=\"\"),COUNTIFS(Registre_IST!$AA:$AA,Rap_Sem!$B$8,Registre_IST!$O:$O,Rap_Sem!$A15,Registre_IST!$G:$G,Rap_Sem!$D$11,Registre_IST!$I:$I,Rap_Sem!D$12),IF(AND($B$9<>\"Tous\",$G$8=\"\"),COUNTIFS(Registre_IST!$AA:$AA,Rap_Sem!$B$8,Registre_IST!$L:$L,Rap_Sem!$B$9,Registre_IST!$O:$O,Rap_Sem!$A15,Registre_IST!$G:$G,Rap_Sem!$D$11,Registre_IST!$I:$I,Rap_Sem!D$12)))))","v":0},{"$f":"IF(AND($B$9<>\"Tous\",$G$8<>\"\"),COUNTIFS(Registre_IST!$AA:$AA,Rap_Sem!$B$8,Registre_IST!$L:$L,Rap_Sem!$B$9,Registre_IST!$O:$O,Rap_Sem!$A15,Registre_IST!$G:$G,Rap_Sem!$D$11,Registre_IST!$I:$I,Rap_Sem!E$12,Registre_IST!$X:$X,Rap_Sem!$G$8),IF(AND($B$9=\"Tous\",$G$8<>\"\"),COUNTIFS(Registre_IST!$AA:$AA,Rap_Sem!$B$8,Registre_IST!$O:$O,Rap_Sem!$A15,Registre_IST!$G:$G,Rap_Sem!$D$11,Registre_IST!$I:$I,Rap_Sem!E$12,Registre_IST!$X:$X,Rap_Sem!$G$8),IF(AND($B$9=\"Tous\",$G$8=\"\"),COUNTIFS(Registre_IST!$AA:$AA,Rap_Sem!$B$8,Registre_IST!$O:$O,Rap_Sem!$A15,Registre_IST!$G:$G,Rap_Sem!$D$11,Registre_IST!$I:$I,Rap_Sem!E$12),IF(AND($B$9<>\"Tous\",$G$8=\"\"),COUNTIFS(Registre_IST!$AA:$AA,Rap_Sem!$B$8,Registre_IST!$L:$L,Rap_Sem!$B$9,Registre_IST!$O:$O,Rap_Sem!$A15,Registre_IST!$G:$G,Rap_Sem!$D$11,Registre_IST!$I:$I,Rap_Sem!E$12)))))","v":0},{"$f":"IF(AND($B$9<>\"Tous\",$G$8<>\"\"),COUNTIFS(Registre_IST!$AA:$AA,Rap_Sem!$B$8,Registre_IST!$L:$L,Rap_Sem!$B$9,Registre_IST!$O:$O,Rap_Sem!$A15,Registre_IST!$G:$G,Rap_Sem!$F$11,Registre_IST!$I:$I,Rap_Sem!F$12,Registre_IST!$X:$X,Rap_Sem!$G$8),IF(AND($B$9=\"Tous\",$G$8<>\"\"),COUNTIFS(Registre_IST!$AA:$AA,Rap_Sem!$B$8,Registre_IST!$O:$O,Rap_Sem!$A15,Registre_IST!$G:$G,Rap_Sem!$F$11,Registre_IST!$I:$I,Rap_Sem!F$12,Registre_IST!$X:$X,Rap_Sem!$G$8),IF(AND($B$9=\"Tous\",$G$8=\"\"),COUNTIFS(Registre_IST!$AA:$AA,Rap_Sem!$B$8,Registre_IST!$O:$O,Rap_Sem!$A15,Registre_IST!$G:$G,Rap_Sem!$F$11,Registre_IST!$I:$I,Rap_Sem!F$12),IF(AND($B$9<>\"Tous\",$G$8=\"\"),COUNTIFS(Registre_IST!$AA:$AA,Rap_Sem!$B$8,Registre_IST!$L:$L,Rap_Sem!$B$9,Registre_IST!$O:$O,Rap_Sem!$A15,Registre_IST!$G:$G,Rap_Sem!$F$11,Registre_IST!$I:$I,Rap_Sem!F$12)))))","v":0},{"$f":"IF(AND($B$9<>\"Tous\",$G$8<>\"\"),COUNTIFS(Registre_IST!$AA:$AA,Rap_Sem!$B$8,Registre_IST!$L:$L,Rap_Sem!$B$9,Registre_IST!$O:$O,Rap_Sem!$A15,Registre_IST!$G:$G,Rap_Sem!$F$11,Registre_IST!$I:$I,Rap_Sem!G$12,Registre_IST!$X:$X,Rap_Sem!$G$8),IF(AND($B$9=\"Tous\",$G$8<>\"\"),COUNTIFS(Registre_IST!$AA:$AA,Rap_Sem!$B$8,Registre_IST!$O:$O,Rap_Sem!$A15,Registre_IST!$G:$G,Rap_Sem!$F$11,Registre_IST!$I:$I,Rap_Sem!G$12,Registre_IST!$X:$X,Rap_Sem!$G$8),IF(AND($B$9=\"Tous\",$G$8=\"\"),COUNTIFS(Registre_IST!$AA:$AA,Rap_Sem!$B$8,Registre_IST!$O:$O,Rap_Sem!$A15,Registre_IST!$G:$G,Rap_Sem!$F$11,Registre_IST!$I:$I,Rap_Sem!G$12),IF(AND($B$9<>\"Tous\",$G$8=\"\"),COUNTIFS(Registre_IST!$AA:$AA,Rap_Sem!$B$8,Registre_IST!$L:$L,Rap_Sem!$B$9,Registre_IST!$O:$O,Rap_Sem!$A15,Registre_IST!$G:$G,Rap_Sem!$F$11,Registre_IST!$I:$I,Rap_Sem!G$12)))))","v":0},{"$f":"IF(AND($B$9<>\"Tous\",$G$8<>\"\"),COUNTIFS(Registre_IST!$AA:$AA,Rap_Sem!$B$8,Registre_IST!$L:$L,Rap_Sem!$B$9,Registre_IST!$O:$O,Rap_Sem!$A15,Registre_IST!$G:$G,Rap_Sem!$H$11,Registre_IST!$I:$I,Rap_Sem!H$12,Registre_IST!$X:$X,Rap_Sem!$G$8),IF(AND($B$9=\"Tous\",$G$8<>\"\"),COUNTIFS(Registre_IST!$AA:$AA,Rap_Sem!$B$8,Registre_IST!$O:$O,Rap_Sem!$A15,Registre_IST!$G:$G,Rap_Sem!$H$11,Registre_IST!$I:$I,Rap_Sem!H$12,Registre_IST!$X:$X,Rap_Sem!$G$8),IF(AND($B$9=\"Tous\",$G$8=\"\"),COUNTIFS(Registre_IST!$AA:$AA,Rap_Sem!$B$8,Registre_IST!$O:$O,Rap_Sem!$A15,Registre_IST!$G:$G,Rap_Sem!$H$11,Registre_IST!$I:$I,Rap_Sem!H$12),IF(AND($B$9<>\"Tous\",$G$8=\"\"),COUNTIFS(Registre_IST!$AA:$AA,Rap_Sem!$B$8,Registre_IST!$L:$L,Rap_Sem!$B$9,Registre_IST!$O:$O,Rap_Sem!$A15,Registre_IST!$G:$G,Rap_Sem!$H$11,Registre_IST!$I:$I,Rap_Sem!H$12)))))","v":0},{"$f":"IF(AND($B$9<>\"Tous\",$G$8<>\"\"),COUNTIFS(Registre_IST!$AA:$AA,Rap_Sem!$B$8,Registre_IST!$L:$L,Rap_Sem!$B$9,Registre_IST!$O:$O,Rap_Sem!$A15,Registre_IST!$G:$G,Rap_Sem!$H$11,Registre_IST!$I:$I,Rap_Sem!I$12,Registre_IST!$X:$X,Rap_Sem!$G$8),IF(AND($B$9=\"Tous\",$G$8<>\"\"),COUNTIFS(Registre_IST!$AA:$AA,Rap_Sem!$B$8,Registre_IST!$O:$O,Rap_Sem!$A15,Registre_IST!$G:$G,Rap_Sem!$H$11,Registre_IST!$I:$I,Rap_Sem!I$12,Registre_IST!$X:$X,Rap_Sem!$G$8),IF(AND($B$9=\"Tous\",$G$8=\"\"),COUNTIFS(Registre_IST!$AA:$AA,Rap_Sem!$B$8,Registre_IST!$O:$O,Rap_Sem!$A15,Registre_IST!$G:$G,Rap_Sem!$H$11,Registre_IST!$I:$I,Rap_Sem!I$12),IF(AND($B$9<>\"Tous\",$G$8=\"\"),COUNTIFS(Registre_IST!$AA:$AA,Rap_Sem!$B$8,Registre_IST!$L:$L,Rap_Sem!$B$9,Registre_IST!$O:$O,Rap_Sem!$A15,Registre_IST!$G:$G,Rap_Sem!$H$11,Registre_IST!$I:$I,Rap_Sem!I$12)))))","v":0},{"$f":"IF(AND($B$9<>\"Tous\",$G$8<>\"\"),COUNTIFS(Registre_IST!$AA:$AA,Rap_Sem!$B$8,Registre_IST!$L:$L,Rap_Sem!$B$9,Registre_IST!$O:$O,Rap_Sem!$A15,Registre_IST!$G:$G,Rap_Sem!$J$11,Registre_IST!$I:$I,Rap_Sem!J$12,Registre_IST!$X:$X,Rap_Sem!$G$8),IF(AND($B$9=\"Tous\",$G$8<>\"\"),COUNTIFS(Registre_IST!$AA:$AA,Rap_Sem!$B$8,Registre_IST!$O:$O,Rap_Sem!$A15,Registre_IST!$G:$G,Rap_Sem!$J$11,Registre_IST!$I:$I,Rap_Sem!J$12,Registre_IST!$X:$X,Rap_Sem!$G$8),IF(AND($B$9=\"Tous\",$G$8=\"\"),COUNTIFS(Registre_IST!$AA:$AA,Rap_Sem!$B$8,Registre_IST!$O:$O,Rap_Sem!$A15,Registre_IST!$G:$G,Rap_Sem!$J$11,Registre_IST!$I:$I,Rap_Sem!J$12),IF(AND($B$9<>\"Tous\",$G$8=\"\"),COUNTIFS(Registre_IST!$AA:$AA,Rap_Sem!$B$8,Registre_IST!$L:$L,Rap_Sem!$B$9,Registre_IST!$O:$O,Rap_Sem!$A15,Registre_IST!$G:$G,Rap_Sem!$J$11,Registre_IST!$I:$I,Rap_Sem!J$12)))))","v":0},{"$f":"IF(AND($B$9<>\"Tous\",$G$8<>\"\"),COUNTIFS(Registre_IST!$AA:$AA,Rap_Sem!$B$8,Registre_IST!$L:$L,Rap_Sem!$B$9,Registre_IST!$O:$O,Rap_Sem!$A15,Registre_IST!$G:$G,Rap_Sem!$J$11,Registre_IST!$I:$I,Rap_Sem!K$12,Registre_IST!$X:$X,Rap_Sem!$G$8),IF(AND($B$9=\"Tous\",$G$8<>\"\"),COUNTIFS(Registre_IST!$AA:$AA,Rap_Sem!$B$8,Registre_IST!$O:$O,Rap_Sem!$A15,Registre_IST!$G:$G,Rap_Sem!$J$11,Registre_IST!$I:$I,Rap_Sem!K$12,Registre_IST!$X:$X,Rap_Sem!$G$8),IF(AND($B$9=\"Tous\",$G$8=\"\"),COUNTIFS(Registre_IST!$AA:$AA,Rap_Sem!$B$8,Registre_IST!$O:$O,Rap_Sem!$A15,Registre_IST!$G:$G,Rap_Sem!$J$11,Registre_IST!$I:$I,Rap_Sem!K$12),IF(AND($B$9<>\"Tous\",$G$8=\"\"),COUNTIFS(Registre_IST!$AA:$AA,Rap_Sem!$B$8,Registre_IST!$L:$L,Rap_Sem!$B$9,Registre_IST!$O:$O,Rap_Sem!$A15,Registre_IST!$G:$G,Rap_Sem!$J$11,Registre_IST!$I:$I,Rap_Sem!K$12)))))","v":0}]
["Ulcère génital",{"$f":"IF(AND($B$9<>\"Tous\",$G$8<>\"\"),COUNTIFS(Registre_IST!$AA:$AA,Rap_Sem!$B$8,Registre_IST!$L:$L,Rap_Sem!$B$9,Registre_IST!$O:$O,Rap_Sem!$A16,Registre_IST!$G:$G,Rap_Sem!$B$11,Registre_IST!$I:$I,Rap_Sem!B$12,Registre_IST!$X:$X,Rap_Sem!$G$8),IF(AND($B$9=\"Tous\",$G$8<>\"\"),COUNTIFS(Registre_IST!$AA:$AA,Rap_Sem!$B$8,Registre_IST!$O:$O,Rap_Sem!$A16,Registre_IST!$G:$G,Rap_Sem!$B$11,Registre_IST!$I:$I,Rap_Sem!B$12,Registre_IST!$X:$X,Rap_Sem!$G$8),IF(AND($B$9=\"Tous\",$G$8=\"\"),COUNTIFS(Registre_IST!$AA:$AA,Rap_Sem!$B$8,Registre_IST!$O:$O,Rap_Sem!$A16,Registre_IST!$G:$G,Rap_Sem!$B$11,Registre_IST!$I:$I,Rap_Sem!B$12),IF(AND($B$9<>\"Tous\",$G$8=\"\"),COUNTIFS(Registre_IST!$AA:$AA,Rap_Sem!$B$8,Registre_IST!$L:$L,Rap_Sem!$B$9,Registre_IST!$O:$O,Rap_Sem!$A16,Registre_IST!$G:$G,Rap_Sem!$B$11,Registre_IST!$I:$I,Rap_Sem!B$12)))))","v":0},{"$f":"IF(AND($B$9<>\"Tous\",$G$8<>\"\"),COUNTIFS(Registre_IST!$AA:$AA,Rap_Sem!$B$8,Registre_IST!$L:$L,Rap_Sem!$B$9,Registre_IST!$O:$O,Rap_Sem!$A16,Registre_IST!$G:$G,Rap_Sem!$B$11,Registre_IST!$I:$I,Rap_Sem!C$12,Registre_IST!$X:$X,Rap_Sem!$G$8),IF(AND($B$9=\"Tous\",$G$8<>\"\"),COUNTIFS(Registre_IST!$AA:$AA,Rap_Sem!$B$8,Registre_IST!$O:$O,Rap_Sem!$A16,Registre_IST!$G:$G,Rap_Sem!$B$11,Registre_IST!$I:$I,Rap_Sem!C$12,Registre_IST!$X:$X,Rap_Sem!$G$8),IF(AND($B$9=\"Tous\",$G$8=\"\"),COUNTIFS(Registre_IST!$AA:$AA,Rap_Sem!$B$8,Registre_IST!$O:$O,Rap_Sem!$A16,Registre_IST!$G:$G,Rap_Sem!$B$11,Registre_IST!$I:$I,Rap_Sem!C$12),IF(AND($B$9<>\"Tous\",$G$8=\"\"),COUNTIFS(Registre_IST!$AA:$AA,Rap_Sem!$B$8,Registre_IST!$L:$L,Rap_Sem!$B$9,Registre_IST!$O:$O,Rap_Sem!$A16,Registre_IST!$G:$G,Rap_Sem!$B$11,Registre_IST!$I:$I,Rap_Sem!C$12)))))","v":0},{"$f":"IF(AND($B$9<>\"Tous\",$G$8<>\"\"),COUNTIFS(Registre_IST!$AA:$AA,Rap_Sem!$B$8,Registre_IST!$L:$L,Rap_Sem!$B$9,Registre_IST!$O:$O,Rap_Sem!$A16,Registre_IST!$G:$G,Rap_Sem!$D$11,Registre_IST!$I:$I,Rap_Sem!D$12,Registre_IST!$X:$X,Rap_Sem!$G$8),IF(AND($B$9=\"Tous\",$G$8<>\"\"),COUNTIFS(Registre_IST!$AA:$AA,Rap_Sem!$B$8,Registre_IST!$O:$O,Rap_Sem!$A16,Registre_IST!$G:$G,Rap_Sem!$D$11,Registre_IST!$I:$I,Rap_Sem!D$12,Registre_IST!$X:$X,Rap_Sem!$G$8),IF(AND($B$9=\"Tous\",$G$8=\"\"),COUNTIFS(Registre_IST!$AA:$AA,Rap_Sem!$B$8,Registre_IST!$O:$O,Rap_Sem!$A16,Registre_IST!$G:$G,Rap_Sem!$D$11,Registre_IST!$I:$I,Rap_Sem!D$12),IF(AND($B$9<>\"Tous\",$G$8=\"\"),COUNTIFS(Registre_IST!$AA:$AA,Rap_Sem!$B$8,Registre_IST!$L:$L,Rap_Sem!$B$9,Registre_IST!$O:$O,Rap_Sem!$A16,Registre_IST!$G:$G,Rap_Sem!$D$11,Registre_IST!$I:$I,Rap_Sem!D$12)))))","v":0},{"$f":"IF(AND($B$9<>\"Tous\",$G$8<>\"\"),COUNTIFS(Registre_IST!$AA:$AA,Rap_Sem!$B$8,Registre_IST!$L:$L,Rap_Sem!$B$9,Registre_IST!$O:$O,Rap_Sem!$A16,Registre_IST!$G:$G,Rap_Sem!$D$11,Registre_IST!$I:$I,Rap_Sem!E$12,Registre_IST!$X:$X,Rap_Sem!$G$8),IF(AND($B$9=\"Tous\",$G$8<>\"\"),COUNTIFS(Registre_IST!$AA:$AA,Rap_Sem!$B$8,Registre_IST!$O:$O,Rap_Sem!$A16,Registre_IST!$G:$G,Rap_Sem!$D$11,Registre_IST!$I:$I,Rap_Sem!E$12,Registre_IST!$X:$X,Rap_Sem!$G$8),IF(AND($B$9=\"Tous\",$G$8=\"\"),COUNTIFS(Registre_IST!$AA:$AA,Rap_Sem!$B$8,Registre_IST!$O:$O,Rap_Sem!$A16,Registre_IST!$G:$G,Rap_Sem!$D$11,Registre_IST!$I:$I,Rap_Sem!E$12),IF(AND($B$9<>\"Tous\",$G$8=\"\"),COUNTIFS(Registre_IST!$AA:$AA,Rap_Sem!$B$8,Registre_IST!$L:$L,Rap_Sem!$B$9,Registre_IST!$O:$O,Rap_Sem!$A16,Registre_IST!$G:$G,Rap_Sem!$D$11,Registre_IST!$I:$I,Rap_Sem!E$12)))))","v":0},{"$f":"IF(AND($B$9<>\"Tous\",$G$8<>\"\"),COUNTIFS(Registre_IST!$AA:$AA,Rap_Sem!$B$8,Registre_IST!$L:$L,Rap_Sem!$B$9,Registre_IST!$O:$O,Rap_Sem!$A16,Registre_IST!$G:$G,Rap_Sem!$F$11,Registre_IST!$I:$I,Rap_Sem!F$12,Registre_IST!$X:$X,Rap_Sem!$G$8),IF(AND($B$9=\"Tous\",$G$8<>\"\"),COUNTIFS(Registre_IST!$AA:$AA,Rap_Sem!$B$8,Registre_IST!$O:$O,Rap_Sem!$A16,Registre_IST!$G:$G,Rap_Sem!$F$11,Registre_IST!$I:$I,Rap_Sem!F$12,Registre_IST!$X:$X,Rap_Sem!$G$8),IF(AND($B$9=\"Tous\",$G$8=\"\"),COUNTIFS(Registre_IST!$AA:$AA,Rap_Sem!$B$8,Registre_IST!$O:$O,Rap_Sem!$A16,Registre_IST!$G:$G,Rap_Sem!$F$11,Registre_IST!$I:$I,Rap_Sem!F$12),IF(AND($B$9<>\"Tous\",$G$8=\"\"),COUNTIFS(Registre_IST!$AA:$AA,Rap_Sem!$B$8,Registre_IST!$L:$L,Rap_Sem!$B$9,Registre_IST!$O:$O,Rap_Sem!$A16,Registre_IST!$G:$G,Rap_Sem!$F$11,Registre_IST!$I:$I,Rap_Sem!F$12)))))","v":0},{"$f":"IF(AND($B$9<>\"Tous\",$G$8<>\"\"),COUNTIFS(Registre_IST!$AA:$AA,Rap_Sem!$B$8,Registre_IST!$L:$L,Rap_Sem!$B$9,Registre_IST!$O:$O,Rap_Sem!$A16,Registre_IST!$G:$G,Rap_Sem!$F$11,Registre_IST!$I:$I,Rap_Sem!G$12,Registre_IST!$X:$X,Rap_Sem!$G$8),IF(AND($B$9=\"Tous\",$G$8<>\"\"),COUNTIFS(Registre_IST!$AA:$AA,Rap_Sem!$B$8,Registre_IST!$O:$O,Rap_Sem!$A16,Registre_IST!$G:$G,Rap_Sem!$F$11,Registre_IST!$I:$I,Rap_Sem!G$12,Registre_IST!$X:$X,Rap_Sem!$G$8),IF(AND($B$9=\"Tous\",$G$8=\"\"),COUNTIFS(Registre_IST!$AA:$AA,Rap_Sem!$B$8,Registre_IST!$O:$O,Rap_Sem!$A16,Registre_IST!$G:$G,Rap_Sem!$F$11,Registre_IST!$I:$I,Rap_Sem!G$12),IF(AND($B$9<>\"Tous\",$G$8=\"\"),COUNTIFS(Registre_IST!$AA:$AA,Rap_Sem!$B$8,Registre_IST!$L:$L,Rap_Sem!$B$9,Registre_IST!$O:$O,Rap_Sem!$A16,Registre_IST!$G:$G,Rap_Sem!$F$11,Registre_IST!$I:$I,Rap_Sem!G$12)))))","v":0},{"$f":"IF(AND($B$9<>\"Tous\",$G$8<>\"\"),COUNTIFS(Registre_IST!$AA:$AA,Rap_Sem!$B$8,Registre_IST!$L:$L,Rap_Sem!$B$9,Registre_IST!$O:$O,Rap_Sem!$A16,Registre_IST!$G:$G,Rap_Sem!$H$11,Registre_IST!$I:$I,Rap_Sem!H$12,Registre_IST!$X:$X,Rap_Sem!$G$8),IF(AND($B$9=\"Tous\",$G$8<>\"\"),COUNTIFS(Registre_IST!$AA:$AA,Rap_Sem!$B$8,Registre_IST!$O:$O,Rap_Sem!$A16,Registre_IST!$G:$G,Rap_Sem!$H$11,Registre_IST!$I:$I,Rap_Sem!H$12,Registre_IST!$X:$X,Rap_Sem!$G$8),IF(AND($B$9=\"Tous\",$G$8=\"\"),COUNTIFS(Registre_IST!$AA:$AA,Rap_Sem!$B$8,Registre_IST!$O:$O,Rap_Sem!$A16,Registre_IST!$G:$G,Rap_Sem!$H$11,Registre_IST!$I:$I,Rap_Sem!H$12),IF(AND($B$9<>\"Tous\",$G$8=\"\"),COUNTIFS(Registre_IST!$AA:$AA,Rap_Sem!$B$8,Registre_IST!$L:$L,Rap_Sem!$B$9,Registre_IST!$O:$O,Rap_Sem!$A16,Registre_IST!$G:$G,Rap_Sem!$H$11,Registre_IST!$I:$I,Rap_Sem!H$12)))))","v":0},{"$f":"IF(AND($B$9<>\"Tous\",$G$8<>\"\"),COUNTIFS(Registre_IST!$AA:$AA,Rap_Sem!$B$8,Registre_IST!$L:$L,Rap_Sem!$B$9,Registre_IST!$O:$O,Rap_Sem!$A16,Registre_IST!$G:$G,Rap_Sem!$H$11,Registre_IST!$I:$I,Rap_Sem!I$12,Registre_IST!$X:$X,Rap_Sem!$G$8),IF(AND($B$9=\"Tous\",$G$8<>\"\"),COUNTIFS(Registre_IST!$AA:$AA,Rap_Sem!$B$8,Registre_IST!$O:$O,Rap_Sem!$A16,Registre_IST!$G:$G,Rap_Sem!$H$11,Registre_IST!$I:$I,Rap_Sem!I$12,Registre_IST!$X:$X,Rap_Sem!$G$8),IF(AND($B$9=\"Tous\",$G$8=\"\"),COUNTIFS(Registre_IST!$AA:$AA,Rap_Sem!$B$8,Registre_IST!$O:$O,Rap_Sem!$A16,Registre_IST!$G:$G,Rap_Sem!$H$11,Registre_IST!$I:$I,Rap_Sem!I$12),IF(AND($B$9<>\"Tous\",$G$8=\"\"),COUNTIFS(Registre_IST!$AA:$AA,Rap_Sem!$B$8,Registre_IST!$L:$L,Rap_Sem!$B$9,Registre_IST!$O:$O,Rap_Sem!$A16,Registre_IST!$G:$G,Rap_Sem!$H$11,Registre_IST!$I:$I,Rap_Sem!I$12)))))","v":0},{"$f":"IF(AND($B$9<>\"Tous\",$G$8<>\"\"),COUNTIFS(Registre_IST!$AA:$AA,Rap_Sem!$B$8,Registre_IST!$L:$L,Rap_Sem!$B$9,Registre_IST!$O:$O,Rap_Sem!$A16,Registre_IST!$G:$G,Rap_Sem!$J$11,Registre_IST!$I:$I,Rap_Sem!J$12,Registre_IST!$X:$X,Rap_Sem!$G$8),IF(AND($B$9=\"Tous\",$G$8<>\"\"),COUNTIFS(Registre_IST!$AA:$AA,Rap_Sem!$B$8,Registre_IST!$O:$O,Rap_Sem!$A16,Registre_IST!$G:$G,Rap_Sem!$J$11,Registre_IST!$I:$I,Rap_Sem!J$12,Registre_IST!$X:$X,Rap_Sem!$G$8),IF(AND($B$9=\"Tous\",$G$8=\"\"),COUNTIFS(Registre_IST!$AA:$AA,Rap_Sem!$B$8,Registre_IST!$O:$O,Rap_Sem!$A16,Registre_IST!$G:$G,Rap_Sem!$J$11,Registre_IST!$I:$I,Rap_Sem!J$12),IF(AND($B$9<>\"Tous\",$G$8=\"\"),COUNTIFS(Registre_IST!$AA:$AA,Rap_Sem!$B$8,Registre_IST!$L:$L,Rap_Sem!$B$9,Registre_IST!$O:$O,Rap_Sem!$A16,Registre_IST!$G:$G,Rap_Sem!$J$11,Registre_IST!$I:$I,Rap_Sem!J$12)))))","v":0},{"$f":"IF(AND($B$9<>\"Tous\",$G$8<>\"\"),COUNTIFS(Registre_IST!$AA:$AA,Rap_Sem!$B$8,Registre_IST!$L:$L,Rap_Sem!$B$9,Registre_IST!$O:$O,Rap_Sem!$A16,Registre_IST!$G:$G,Rap_Sem!$J$11,Registre_IST!$I:$I,Rap_Sem!K$12,Registre_IST!$X:$X,Rap_Sem!$G$8),IF(AND($B$9=\"Tous\",$G$8<>\"\"),COUNTIFS(Registre_IST!$AA:$AA,Rap_Sem!$B$8,Registre_IST!$O:$O,Rap_Sem!$A16,Registre_IST!$G:$G,Rap_Sem!$J$11,Registre_IST!$I:$I,Rap_Sem!K$12,Registre_IST!$X:$X,Rap_Sem!$G$8),IF(AND($B$9=\"Tous\",$G$8=\"\"),COUNTIFS(Registre_IST!$AA:$AA,Rap_Sem!$B$8,Registre_IST!$O:$O,Rap_Sem!$A16,Registre_IST!$G:$G,Rap_Sem!$J$11,Registre_IST!$I:$I,Rap_Sem!K$12),IF(AND($B$9<>\"Tous\",$G$8=\"\"),COUNTIFS(Registre_IST!$AA:$AA,Rap_Sem!$B$8,Registre_IST!$L:$L,Rap_Sem!$B$9,Registre_IST!$O:$O,Rap_Sem!$A16,Registre_IST!$G:$G,Rap_Sem!$J$11,Registre_IST!$I:$I,Rap_Sem!K$12)))))","v":0}]
["Douleurs bas ventre",{"$f":"IF(AND($B$9<>\"Tous\",$G$8<>\"\"),COUNTIFS(Registre_IST!$AA:$AA,Rap_Sem!$B$8,Registre_IST!$L:$L,Rap_Sem!$B$9,Registre_IST!$O:$O,Rap_Sem!$A17,Registre_IST!$G:$G,Rap_Sem!$B$11,Registre_IST!$I:$I,Rap_Sem!B$12,Registre_IST!$X:$X,Rap_Sem!$G$8),IF(AND($B$9=\"Tous\",$G$8<>\"\"),COUNTIFS(Registre_IST!$AA:$AA,Rap_Sem!$B$8,Registre_IST!$O:$O,Rap_Sem!$A17,Registre_IST!$G:$G,Rap_Sem!$B$11,Registre_IST!$I:$I,Rap_Sem!B$12,Registre_IST!$X:$X,Rap_Sem!$G$8),IF(AND($B$9=\"Tous\",$G$8=\"\"),COUNTIFS(Registre_IST!$AA:$AA,Rap_Sem!$B$8,Registre_IST!$O:$O,Rap_Sem!$A17,Registre_IST!$G:$G,Rap_Sem!$B$11,Registre_IST!$I:$I,Rap_Sem!B$12),IF(AND($B$9<>\"Tous\",$G$8=\"\"),COUNTIFS(Registre_IST!$AA:$AA,Rap_Sem!$B$8,Registre_IST!$L:$L,Rap_Sem!$B$9,Registre_IST!$O:$O,Rap_Sem!$A17,Registre_IST!$G:$G,Rap_Sem!$B$11,Registre_IST!$I:$I,Rap_Sem!B$12)))))","v":0},{"$f":"IF(AND($B$9<>\"Tous\",$G$8<>\"\"),COUNTIFS(Registre_IST!$AA:$AA,Rap_Sem!$B$8,Registre_IST!$L:$L,Rap_Sem!$B$9,Registre_IST!$O:$O,Rap_Sem!$A17,Registre_IST!$G:$G,Rap_Sem!$B$11,Registre_IST!$I:$I,Rap_Sem!C$12,Registre_IST!$X:$X,Rap_Sem!$G$8),IF(AND($B$9=\"Tous\",$G$8<>\"\"),COUNTIFS(Registre_IST!$AA:$AA,Rap_Sem!$B$8,Registre_IST!$O:$O,Rap_Sem!$A17,Registre_IST!$G:$G,Rap_Sem!$B$11,Registre_IST!$I:$I,Rap_Sem!C$12,Registre_IST!$X:$X,Rap_Sem!$G$8),IF(AND($B$9=\"Tous\",$G$8=\"\"),COUNTIFS(Registre_IST!$AA:$AA,Rap_Sem!$B$8,Registre_IST!$O:$O,Rap_Sem!$A17,Registre_IST!$G:$G,Rap_Sem!$B$11,Registre_IST!$I:$I,Rap_Sem!C$12),IF(AND($B$9<>\"Tous\",$G$8=\"\"),COUNTIFS(Registre_IST!$AA:$AA,Rap_Sem!$B$8,Registre_IST!$L:$L,Rap_Sem!$B$9,Registre_IST!$O:$O,Rap_Sem!$A17,Registre_IST!$G:$G,Rap_Sem!$B$11,Registre_IST!$I:$I,Rap_Sem!C$12)))))","v":0},{"$f":"IF(AND($B$9<>\"Tous\",$G$8<>\"\"),COUNTIFS(Registre_IST!$AA:$AA,Rap_Sem!$B$8,Registre_IST!$L:$L,Rap_Sem!$B$9,Registre_IST!$O:$O,Rap_Sem!$A17,Registre_IST!$G:$G,Rap_Sem!$D$11,Registre_IST!$I:$I,Rap_Sem!D$12,Registre_IST!$X:$X,Rap_Sem!$G$8),IF(AND($B$9=\"Tous\",$G$8<>\"\"),COUNTIFS(Registre_IST!$AA:$AA,Rap_Sem!$B$8,Registre_IST!$O:$O,Rap_Sem!$A17,Registre_IST!$G:$G,Rap_Sem!$D$11,Registre_IST!$I:$I,Rap_Sem!D$12,Registre_IST!$X:$X,Rap_Sem!$G$8),IF(AND($B$9=\"Tous\",$G$8=\"\"),COUNTIFS(Registre_IST!$AA:$AA,Rap_Sem!$B$8,Registre_IST!$O:$O,Rap_Sem!$A17,Registre_IST!$G:$G,Rap_Sem!$D$11,Registre_IST!$I:$I,Rap_Sem!D$12),IF(AND($B$9<>\"Tous\",$G$8=\"\"),COUNTIFS(Registre_IST!$AA:$AA,Rap_Sem!$B$8,Registre_IST!$L:$L,Rap_Sem!$B$9,Registre_IST!$O:$O,Rap_Sem!$A17,Registre_IST!$G:$G,Rap_Sem!$D$11,Registre_IST!$I:$I,Rap_Sem!D$12)))))","v":0},{"$f":"IF(AND($B$9<>\"Tous\",$G$8<>\"\"),COUNTIFS(Registre_IST!$AA:$AA,Rap_Sem!$B$8,Registre_IST!$L:$L,Rap_Sem!$B$9,Registre_IST!$O:$O,Rap_Sem!$A17,Registre_IST!$G:$G,Rap_Sem!$D$11,Registre_IST!$I:$I,Rap_Sem!E$12,Registre_IST!$X:$X,Rap_Sem!$G$8),IF(AND($B$9=\"Tous\",$G$8<>\"\"),COUNTIFS(Registre_IST!$AA:$AA,Rap_Sem!$B$8,Registre_IST!$O:$O,Rap_Sem!$A17,Registre_IST!$G:$G,Rap_Sem!$D$11,Registre_IST!$I:$I,Rap_Sem!E$12,Registre_IST!$X:$X,Rap_Sem!$G$8),IF(AND($B$9=\"Tous\",$G$8=\"\"),COUNTIFS(Registre_IST!$AA:$AA,Rap_Sem!$B$8,Registre_IST!$O:$O,Rap_Sem!$A17,Registre_IST!$G:$G,Rap_Sem!$D$11,Registre_IST!$I:$I,Rap_Sem!E$12),IF(AND($B$9<>\"Tous\",$G$8=\"\"),COUNTIFS(Registre_IST!$AA:$AA,Rap_Sem!$B$8,Registre_IST!$L:$L,Rap_Sem!$B$9,Registre_IST!$O:$O,Rap_Sem!$A17,Registre_IST!$G:$G,Rap_Sem!$D$11,Registre_IST!$I:$I,Rap_Sem!E$12)))))","v":0},{"$f":"IF(AND($B$9<>\"Tous\",$G$8<>\"\"),COUNTIFS(Registre_IST!$AA:$AA,Rap_Sem!$B$8,Registre_IST!$L:$L,Rap_Sem!$B$9,Registre_IST!$O:$O,Rap_Sem!$A17,Registre_IST!$G:$G,Rap_Sem!$F$11,Registre_IST!$I:$I,Rap_Sem!F$12,Registre_IST!$X:$X,Rap_Sem!$G$8),IF(AND($B$9=\"Tous\",$G$8<>\"\"),COUNTIFS(Registre_IST!$AA:$AA,Rap_Sem!$B$8,Registre_IST!$O:$O,Rap_Sem!$A17,Registre_IST!$G:$G,Rap_Sem!$F$11,Registre_IST!$I:$I,Rap_Sem!F$12,Registre_IST!$X:$X,Rap_Sem!$G$8),IF(AND($B$9=\"Tous\",$G$8=\"\"),COUNTIFS(Registre_IST!$AA:$AA,Rap_Sem!$B$8,Registre_IST!$O:$O,Rap_Sem!$A17,Registre_IST!$G:$G,Rap_Sem!$F$11,Registre_IST!$I:$I,Rap_Sem!F$12),IF(AND($B$9<>\"Tous\",$G$8=\"\"),COUNTIFS(Registre_IST!$AA:$AA,Rap_Sem!$B$8,Registre_IST!$L:$L,Rap_Sem!$B$9,Registre_IST!$O:$O,Rap_Sem!$A17,Registre_IST!$G:$G,Rap_Sem!$F$11,Registre_IST!$I:$I,Rap_Sem!F$12)))))","v":0},{"$f":"IF(AND($B$9<>\"Tous\",$G$8<>\"\"),COUNTIFS(Registre_IST!$AA:$AA,Rap_Sem!$B$8,Registre_IST!$L:$L,Rap_Sem!$B$9,Registre_IST!$O:$O,Rap_Sem!$A17,Registre_IST!$G:$G,Rap_Sem!$F$11,Registre_IST!$I:$I,Rap_Sem!G$12,Registre_IST!$X:$X,Rap_Sem!$G$8),IF(AND($B$9=\"Tous\",$G$8<>\"\"),COUNTIFS(Registre_IST!$AA:$AA,Rap_Sem!$B$8,Registre_IST!$O:$O,Rap_Sem!$A17,Registre_IST!$G:$G,Rap_Sem!$F$11,Registre_IST!$I:$I,Rap_Sem!G$12,Registre_IST!$X:$X,Rap_Sem!$G$8),IF(AND($B$9=\"Tous\",$G$8=\"\"),COUNTIFS(Registre_IST!$AA:$AA,Rap_Sem!$B$8,Registre_IST!$O:$O,Rap_Sem!$A17,Registre_IST!$G:$G,Rap_Sem!$F$11,Registre_IST!$I:$I,Rap_Sem!G$12),IF(AND($B$9<>\"Tous\",$G$8=\"\"),COUNTIFS(Registre_IST!$AA:$AA,Rap_Sem!$B$8,Registre_IST!$L:$L,Rap_Sem!$B$9,Registre_IST!$O:$O,Rap_Sem!$A17,Registre_IST!$G:$G,Rap_Sem!$F$11,Registre_IST!$I:$I,Rap_Sem!G$12)))))","v":0},{"$f":"IF(AND($B$9<>\"Tous\",$G$8<>\"\"),COUNTIFS(Registre_IST!$AA:$AA,Rap_Sem!$B$8,Registre_IST!$L:$L,Rap_Sem!$B$9,Registre_IST!$O:$O,Rap_Sem!$A17,Registre_IST!$G:$G,Rap_Sem!$H$11,Registre_IST!$I:$I,Rap_Sem!H$12,Registre_IST!$X:$X,Rap_Sem!$G$8),IF(AND($B$9=\"Tous\",$G$8<>\"\"),COUNTIFS(Registre_IST!$AA:$AA,Rap_Sem!$B$8,Registre_IST!$O:$O,Rap_Sem!$A17,Registre_IST!$G:$G,Rap_Sem!$H$11,Registre_IST!$I:$I,Rap_Sem!H$12,Registre_IST!$X:$X,Rap_Sem!$G$8),IF(AND($B$9=\"Tous\",$G$8=\"\"),COUNTIFS(Registre_IST!$AA:$AA,Rap_Sem!$B$8,Registre_IST!$O:$O,Rap_Sem!$A17,Registre_IST!$G:$G,Rap_Sem!$H$11,Registre_IST!$I:$I,Rap_Sem!H$12),IF(AND($B$9<>\"Tous\",$G$8=\"\"),COUNTIFS(Registre_IST!$AA:$AA,Rap_Sem!$B$8,Registre_IST!$L:$L,Rap_Sem!$B$9,Registre_IST!$O:$O,Rap_Sem!$A17,Registre_IST!$G:$G,Rap_Sem!$H$11,Registre_IST!$I:$I,Rap_Sem!H$12)))))","v":0},{"$f":"IF(AND($B$9<>\"Tous\",$G$8<>\"\"),COUNTIFS(Registre_IST!$AA:$AA,Rap_Sem!$B$8,Registre_IST!$L:$L,Rap_Sem!$B$9,Registre_IST!$O:$O,Rap_Sem!$A17,Registre_IST!$G:$G,Rap_Sem!$H$11,Registre_IST!$I:$I,Rap_Sem!I$12,Registre_IST!$X:$X,Rap_Sem!$G$8),IF(AND($B$9=\"Tous\",$G$8<>\"\"),COUNTIFS(Registre_IST!$AA:$AA,Rap_Sem!$B$8,Registre_IST!$O:$O,Rap_Sem!$A17,Registre_IST!$G:$G,Rap_Sem!$H$11,Registre_IST!$I:$I,Rap_Sem!I$12,Registre_IST!$X:$X,Rap_Sem!$G$8),IF(AND($B$9=\"Tous\",$G$8=\"\"),COUNTIFS(Registre_IST!$AA:$AA,Rap_Sem!$B$8,Registre_IST!$O:$O,Rap_Sem!$A17,Registre_IST!$G:$G,Rap_Sem!$H$11,Registre_IST!$I:$I,Rap_Sem!I$12),IF(AND($B$9<>\"Tous\",$G$8=\"\"),COUNTIFS(Registre_IST!$AA:$AA,Rap_Sem!$B$8,Registre_IST!$L:$L,Rap_Sem!$B$9,Registre_IST!$O:$O,Rap_Sem!$A17,Registre_IST!$G:$G,Rap_Sem!$H$11,Registre_IST!$I:$I,Rap_Sem!I$12)))))","v":0},{"$f":"IF(AND($B$9<>\"Tous\",$G$8<>\"\"),COUNTIFS(Registre_IST!$AA:$AA,Rap_Sem!$B$8,Registre_IST!$L:$L,Rap_Sem!$B$9,Registre_IST!$O:$O,Rap_Sem!$A17,Registre_IST!$G:$G,Rap_Sem!$J$11,Registre_IST!$I:$I,Rap_Sem!J$12,Registre_IST!$X:$X,Rap_Sem!$G$8),IF(AND($B$9=\"Tous\",$G$8<>\"\"),COUNTIFS(Registre_IST!$AA:$AA,Rap_Sem!$B$8,Registre_IST!$O:$O,Rap_Sem!$A17,Registre_IST!$G:$G,Rap_Sem!$J$11,Registre_IST!$I:$I,Rap_Sem!J$12,Registre_IST!$X:$X,Rap_Sem!$G$8),IF(AND($B$9=\"Tous\",$G$8=\"\"),COUNTIFS(Registre_IST!$AA:$AA,Rap_Sem!$B$8,Registre_IST!$O:$O,Rap_Sem!$A17,Registre_IST!$G:$G,Rap_Sem!$J$11,Registre_IST!$I:$I,Rap_Sem!J$12),IF(AND($B$9<>\"Tous\",$G$8=\"\"),COUNTIFS(Registre_IST!$AA:$AA,Rap_Sem!$B$8,Registre_IST!$L:$L,Rap_Sem!$B$9,Registre_IST!$O:$O,Rap_Sem!$A17,Registre_IST!$G:$G,Rap_Sem!$J$11,Registre_IST!$I:$I,Rap_Sem!J$12)))))","v":0},{"$f":"IF(AND($B$9<>\"Tous\",$G$8<>\"\"),COUNTIFS(Registre_IST!$AA:$AA,Rap_Sem!$B$8,Registre_IST!$L:$L,Rap_Sem!$B$9,Registre_IST!$O:$O,Rap_Sem!$A17,Registre_IST!$G:$G,Rap_Sem!$J$11,Registre_IST!$I:$I,Rap_Sem!K$12,Registre_IST!$X:$X,Rap_Sem!$G$8),IF(AND($B$9=\"Tous\",$G$8<>\"\"),COUNTIFS(Registre_IST!$AA:$AA,Rap_Sem!$B$8,Registre_IST!$O:$O,Rap_Sem!$A17,Registre_IST!$G:$G,Rap_Sem!$J$11,Registre_IST!$I:$I,Rap_Sem!K$12,Registre_IST!$X:$X,Rap_Sem!$G$8),IF(AND($B$9=\"Tous\",$G$8=\"\"),COUNTIFS(Registre_IST!$AA:$AA,Rap_Sem!$B$8,Registre_IST!$O:$O,Rap_Sem!$A17,Registre_IST!$G:$G,Rap_Sem!$J$11,Registre_IST!$I:$I,Rap_Sem!K$12),IF(AND($B$9<>\"Tous\",$G$8=\"\"),COUNTIFS(Registre_IST!$AA:$AA,Rap_Sem!$B$8,Registre_IST!$L:$L,Rap_Sem!$B$9,Registre_IST!$O:$O,Rap_Sem!$A17,Registre_IST!$G:$G,Rap_Sem!$J$11,Registre_IST!$I:$I,Rap_Sem!K$12)))))","v":0}]
["Autres",{"$f":"IF(AND($B$9<>\"Tous\",$G$8<>\"\"),COUNTIFS(Registre_IST!$AA:$AA,Rap_Sem!$B$8,Registre_IST!$L:$L,Rap_Sem!$B$9,Registre_IST!$O:$O,Rap_Sem!$A18,Registre_IST!$G:$G,Rap_Sem!$B$11,Registre_IST!$I:$I,Rap_Sem!B$12,Registre_IST!$X:$X,Rap_Sem!$G$8),IF(AND($B$9=\"Tous\",$G$8<>\"\"),COUNTIFS(Registre_IST!$AA:$AA,Rap_Sem!$B$8,Registre_IST!$O:$O,Rap_Sem!$A18,Registre_IST!$G:$G,Rap_Sem!$B$11,Registre_IST!$I:$I,Rap_Sem!B$12,Registre_IST!$X:$X,Rap_Sem!$G$8),IF(AND($B$9=\"Tous\",$G$8=\"\"),COUNTIFS(Registre_IST!$AA:$AA,Rap_Sem!$B$8,Registre_IST!$O:$O,Rap_Sem!$A18,Registre_IST!$G:$G,Rap_Sem!$B$11,Registre_IST!$I:$I,Rap_Sem!B$12),IF(AND($B$9<>\"Tous\",$G$8=\"\"),COUNTIFS(Registre_IST!$AA:$AA,Rap_Sem!$B$8,Registre_IST!$L:$L,Rap_Sem!$B$9,Registre_IST!$O:$O,Rap_Sem!$A18,Registre_IST!$G:$G,Rap_Sem!$B$11,Registre_IST!$I:$I,Rap_Sem!B$12)))))","v":0},{"$f":"IF(AND($B$9<>\"Tous\",$G$8<>\"\"),COUNTIFS(Registre_IST!$AA:$AA,Rap_Sem!$B$8,Registre_IST!$L:$L,Rap_Sem!$B$9,Registre_IST!$O:$O,Rap_Sem!$A18,Registre_IST!$G:$G,Rap_Sem!$B$11,Registre_IST!$I:$I,Rap_Sem!C$12,Registre_IST!$X:$X,Rap_Sem!$G$8),IF(AND($B$9=\"Tous\",$G$8<>\"\"),COUNTIFS(Registre_IST!$AA:$AA,Rap_Sem!$B$8,Registre_IST!$O:$O,Rap_Sem!$A18,Registre_IST!$G:$G,Rap_Sem!$B$11,Registre_IST!$I:$I,Rap_Sem!C$12,Registre_IST!$X:$X,Rap_Sem!$G$8),IF(AND($B$9=\"Tous\",$G$8=\"\"),COUNTIFS(Registre_IST!$AA:$AA,Rap_Sem!$B$8,Registre_IST!$O:$O,Rap_Sem!$A18,Registre_IST!$G:$G,Rap_Sem!$B$11,Registre_IST!$I:$I,Rap_Sem!C$12),IF(AND($B$9<>\"Tous\",$G$8=\"\"),COUNTIFS(Registre_IST!$AA:$AA,Rap_Sem!$B$8,Registre_IST!$L:$L,Rap_Sem!$B$9,Registre_IST!$O:$O,Rap_Sem!$A18,Registre_IST!$G:$G,Rap_Sem!$B$11,Registre_IST!$I:$I,Rap_Sem!C$12)))))","v":0},{"$f":"IF(AND($B$9<>\"Tous\",$G$8<>\"\"),COUNTIFS(Registre_IST!$AA:$AA,Rap_Sem!$B$8,Registre_IST!$L:$L,Rap_Sem!$B$9,Registre_IST!$O:$O,Rap_Sem!$A18,Registre_IST!$G:$G,Rap_Sem!$D$11,Registre_IST!$I:$I,Rap_Sem!D$12,Registre_IST!$X:$X,Rap_Sem!$G$8),IF(AND($B$9=\"Tous\",$G$8<>\"\"),COUNTIFS(Registre_IST!$AA:$AA,Rap_Sem!$B$8,Registre_IST!$O:$O,Rap_Sem!$A18,Registre_IST!$G:$G,Rap_Sem!$D$11,Registre_IST!$I:$I,Rap_Sem!D$12,Registre_IST!$X:$X,Rap_Sem!$G$8),IF(AND($B$9=\"Tous\",$G$8=\"\"),COUNTIFS(Registre_IST!$AA:$AA,Rap_Sem!$B$8,Registre_IST!$O:$O,Rap_Sem!$A18,Registre_IST!$G:$G,Rap_Sem!$D$11,Registre_IST!$I:$I,Rap_Sem!D$12),IF(AND($B$9<>\"Tous\",$G$8=\"\"),COUNTIFS(Registre_IST!$AA:$AA,Rap_Sem!$B$8,Registre_IST!$L:$L,Rap_Sem!$B$9,Registre_IST!$O:$O,Rap_Sem!$A18,Registre_IST!$G:$G,Rap_Sem!$D$11,Registre_IST!$I:$I,Rap_Sem!D$12)))))","v":0},{"$f":"IF(AND($B$9<>\"Tous\",$G$8<>\"\"),COUNTIFS(Registre_IST!$AA:$AA,Rap_Sem!$B$8,Registre_IST!$L:$L,Rap_Sem!$B$9,Registre_IST!$O:$O,Rap_Sem!$A18,Registre_IST!$G:$G,Rap_Sem!$D$11,Registre_IST!$I:$I,Rap_Sem!E$12,Registre_IST!$X:$X,Rap_Sem!$G$8),IF(AND($B$9=\"Tous\",$G$8<>\"\"),COUNTIFS(Registre_IST!$AA:$AA,Rap_Sem!$B$8,Registre_IST!$O:$O,Rap_Sem!$A18,Registre_IST!$G:$G,Rap_Sem!$D$11,Registre_IST!$I:$I,Rap_Sem!E$12,Registre_IST!$X:$X,Rap_Sem!$G$8),IF(AND($B$9=\"Tous\",$G$8=\"\"),COUNTIFS(Registre_IST!$AA:$AA,Rap_Sem!$B$8,Registre_IST!$O:$O,Rap_Sem!$A18,Registre_IST!$G:$G,Rap_Sem!$D$11,Registre_IST!$I:$I,Rap_Sem!E$12),IF(AND($B$9<>\"Tous\",$G$8=\"\"),COUNTIFS(Registre_IST!$AA:$AA,Rap_Sem!$B$8,Registre_IST!$L:$L,Rap_Sem!$B$9,Registre_IST!$O:$O,Rap_Sem!$A18,Registre_IST!$G:$G,Rap_Sem!$D$11,Registre_IST!$I:$I,Rap_Sem!E$12)))))","v":0},{"$f":"IF(AND($B$9<>\"Tous\",$G$8<>\"\"),COUNTIFS(Registre_IST!$AA:$AA,Rap_Sem!$B$8,Registre_IST!$L:$L,Rap_Sem!$B$9,Registre_IST!$O:$O,Rap_Sem!$A18,Registre_IST!$G:$G,Rap_Sem!$F$11,Registre_IST!$I:$I,Rap_Sem!F$12,Registre_IST!$X:$X,Rap_Sem!$G$8),IF(AND($B$9=\"Tous\",$G$8<>\"\"),COUNTIFS(Registre_IST!$AA:$AA,Rap_Sem!$B$8,Registre_IST!$O:$O,Rap_Sem!$A18,Registre_IST!$G:$G,Rap_Sem!$F$11,Registre_IST!$I:$I,Rap_Sem!F$12,Registre_IST!$X:$X,Rap_Sem!$G$8),IF(AND($B$9=\"Tous\",$G$8=\"\"),COUNTIFS(Registre_IST!$AA:$AA,Rap_Sem!$B$8,Registre_IST!$O:$O,Rap_Sem!$A18,Registre_IST!$G:$G,Rap_Sem!$F$11,Registre_IST!$I:$I,Rap_Sem!F$12),IF(AND($B$9<>\"Tous\",$G$8=\"\"),COUNTIFS(Registre_IST!$AA:$AA,Rap_Sem!$B$8,Registre_IST!$L:$L,Rap_Sem!$B$9,Registre_IST!$O:$O,Rap_Sem!$A18,Registre_IST!$G:$G,Rap_Sem!$F$11,Registre_IST!$I:$I,Rap_Sem!F$12)))))","v":0},{"$f":"IF(AND($B$9<>\"Tous\",$G$8<>\"\"),COUNTIFS(Registre_IST!$AA:$AA,Rap_Sem!$B$8,Registre_IST!$L:$L,Rap_Sem!$B$9,Registre_IST!$O:$O,Rap_Sem!$A18,Registre_IST!$G:$G,Rap_Sem!$F$11,Registre_IST!$I:$I,Rap_Sem!G$12,Registre_IST!$X:$X,Rap_Sem!$G$8),IF(AND($B$9=\"Tous\",$G$8<>\"\"),COUNTIFS(Registre_IST!$AA:$AA,Rap_Sem!$B$8,Registre_IST!$O:$O,Rap_Sem!$A18,Registre_IST!$G:$G,Rap_Sem!$F$11,Registre_IST!$I:$I,Rap_Sem!G$12,Registre_IST!$X:$X,Rap_Sem!$G$8),IF(AND($B$9=\"Tous\",$G$8=\"\"),COUNTIFS(Registre_IST!$AA:$AA,Rap_Sem!$B$8,Registre_IST!$O:$O,Rap_Sem!$A18,Registre_IST!$G:$G,Rap_Sem!$F$11,Registre_IST!$I:$I,Rap_Sem!G$12),IF(AND($B$9<>\"Tous\",$G$8=\"\"),COUNTIFS(Registre_IST!$AA:$AA,Rap_Sem!$B$8,Registre_IST!$L:$L,Rap_Sem!$B$9,Registre_IST!$O:$O,Rap_Sem!$A18,Registre_IST!$G:$G,Rap_Sem!$F$11,Registre_IST!$I:$I,Rap_Sem!G$12)))))","v":0},{"$f":"IF(AND($B$9<>\"Tous\",$G$8<>\"\"),COUNTIFS(Registre_IST!$AA:$AA,Rap_Sem!$B$8,Registre_IST!$L:$L,Rap_Sem!$B$9,Registre_IST!$O:$O,Rap_Sem!$A18,Registre_IST!$G:$G,Rap_Sem!$H$11,Registre_IST!$I:$I,Rap_Sem!H$12,Registre_IST!$X:$X,Rap_Sem!$G$8),IF(AND($B$9=\"Tous\",$G$8<>\"\"),COUNTIFS(Registre_IST!$AA:$AA,Rap_Sem!$B$8,Registre_IST!$O:$O,Rap_Sem!$A18,Registre_IST!$G:$G,Rap_Sem!$H$11,Registre_IST!$I:$I,Rap_Sem!H$12,Registre_IST!$X:$X,Rap_Sem!$G$8),IF(AND($B$9=\"Tous\",$G$8=\"\"),COUNTIFS(Registre_IST!$AA:$AA,Rap_Sem!$B$8,Registre_IST!$O:$O,Rap_Sem!$A18,Registre_IST!$G:$G,Rap_Sem!$H$11,Registre_IST!$I:$I,Rap_Sem!H$12),IF(AND($B$9<>\"Tous\",$G$8=\"\"),COUNTIFS(Registre_IST!$AA:$AA,Rap_Sem!$B$8,Registre_IST!$L:$L,Rap_Sem!$B$9,Registre_IST!$O:$O,Rap_Sem!$A18,Registre_IST!$G:$G,Rap_Sem!$H$11,Registre_IST!$I:$I,Rap_Sem!H$12)))))","v":0},{"$f":"IF(AND($B$9<>\"Tous\",$G$8<>\"\"),COUNTIFS(Registre_IST!$AA:$AA,Rap_Sem!$B$8,Registre_IST!$L:$L,Rap_Sem!$B$9,Registre_IST!$O:$O,Rap_Sem!$A18,Registre_IST!$G:$G,Rap_Sem!$H$11,Registre_IST!$I:$I,Rap_Sem!I$12,Registre_IST!$X:$X,Rap_Sem!$G$8),IF(AND($B$9=\"Tous\",$G$8<>\"\"),COUNTIFS(Registre_IST!$AA:$AA,Rap_Sem!$B$8,Registre_IST!$O:$O,Rap_Sem!$A18,Registre_IST!$G:$G,Rap_Sem!$H$11,Registre_IST!$I:$I,Rap_Sem!I$12,Registre_IST!$X:$X,Rap_Sem!$G$8),IF(AND($B$9=\"Tous\",$G$8=\"\"),COUNTIFS(Registre_IST!$AA:$AA,Rap_Sem!$B$8,Registre_IST!$O:$O,Rap_Sem!$A18,Registre_IST!$G:$G,Rap_Sem!$H$11,Registre_IST!$I:$I,Rap_Sem!I$12),IF(AND($B$9<>\"Tous\",$G$8=\"\"),COUNTIFS(Registre_IST!$AA:$AA,Rap_Sem!$B$8,Registre_IST!$L:$L,Rap_Sem!$B$9,Registre_IST!$O:$O,Rap_Sem!$A18,Registre_IST!$G:$G,Rap_Sem!$H$11,Registre_IST!$I:$I,Rap_Sem!I$12)))))","v":0},{"$f":"IF(AND($B$9<>\"Tous\",$G$8<>\"\"),COUNTIFS(Registre_IST!$AA:$AA,Rap_Sem!$B$8,Registre_IST!$L:$L,Rap_Sem!$B$9,Registre_IST!$O:$O,Rap_Sem!$A18,Registre_IST!$G:$G,Rap_Sem!$J$11,Registre_IST!$I:$I,Rap_Sem!J$12,Registre_IST!$X:$X,Rap_Sem!$G$8),IF(AND($B$9=\"Tous\",$G$8<>\"\"),COUNTIFS(Registre_IST!$AA:$AA,Rap_Sem!$B$8,Registre_IST!$O:$O,Rap_Sem!$A18,Registre_IST!$G:$G,Rap_Sem!$J$11,Registre_IST!$I:$I,Rap_Sem!J$12,Registre_IST!$X:$X,Rap_Sem!$G$8),IF(AND($B$9=\"Tous\",$G$8=\"\"),COUNTIFS(Registre_IST!$AA:$AA,Rap_Sem!$B$8,Registre_IST!$O:$O,Rap_Sem!$A18,Registre_IST!$G:$G,Rap_Sem!$J$11,Registre_IST!$I:$I,Rap_Sem!J$12),IF(AND($B$9<>\"Tous\",$G$8=\"\"),COUNTIFS(Registre_IST!$AA:$AA,Rap_Sem!$B$8,Registre_IST!$L:$L,Rap_Sem!$B$9,Registre_IST!$O:$O,Rap_Sem!$A18,Registre_IST!$G:$G,Rap_Sem!$J$11,Registre_IST!$I:$I,Rap_Sem!J$12)))))","v":0},{"$f":"IF(AND($B$9<>\"Tous\",$G$8<>\"\"),COUNTIFS(Registre_IST!$AA:$AA,Rap_Sem!$B$8,Registre_IST!$L:$L,Rap_Sem!$B$9,Registre_IST!$O:$O,Rap_Sem!$A18,Registre_IST!$G:$G,Rap_Sem!$J$11,Registre_IST!$I:$I,Rap_Sem!K$12,Registre_IST!$X:$X,Rap_Sem!$G$8),IF(AND($B$9=\"Tous\",$G$8<>\"\"),COUNTIFS(Registre_IST!$AA:$AA,Rap_Sem!$B$8,Registre_IST!$O:$O,Rap_Sem!$A18,Registre_IST!$G:$G,Rap_Sem!$J$11,Registre_IST!$I:$I,Rap_Sem!K$12,Registre_IST!$X:$X,Rap_Sem!$G$8),IF(AND($B$9=\"Tous\",$G$8=\"\"),COUNTIFS(Registre_IST!$AA:$AA,Rap_Sem!$B$8,Registre_IST!$O:$O,Rap_Sem!$A18,Registre_IST!$G:$G,Rap_Sem!$J$11,Registre_IST!$I:$I,Rap_Sem!K$12),IF(AND($B$9<>\"Tous\",$G$8=\"\"),COUNTIFS(Registre_IST!$AA:$AA,Rap_Sem!$B$8,Registre_IST!$L:$L,Rap_Sem!$B$9,Registre_IST!$O:$O,Rap_Sem!$A18,Registre_IST!$G:$G,Rap_Sem!$J$11,Registre_IST!$I:$I,Rap_Sem!K$12)))))","v":0}]
["Total",{"$f":"SUM(B13:B18)","v":0},{"$f":"SUM(C13:C18)","v":0},0,0,0,0,0,0,0,0]
[]
[]
[]
[null,null,null,null,null,null,null,"Signé par :"]
[]
[]
[]
[null,null,null,null,null,null,null,"Qualité :"]

{"sheet":"Rap_Trim","index":8,"n_rows":27,"n_cols":11,"rows_kept":27,"cut":false,"hidden":true,"merged":[[10,5,10,6],[10,7,10,8],[10,9,10,10],[1,2,1,3],[2,2,2,3],[3,2,3,3],[10,1,10,2],[10,3,10,4]]}
["Association de Lutte Contre le Sida"]
["Section",null,{"$f":"IF(Accueil!$D$9<>\"\",Accueil!$D$9,\"\")","v":""}]
["Année",null,{"$f":"IF(Accueil!$D$10<>\"\",Accueil!$D$10,\"\")","v":""}]
["CIDAG",null,{"$f":"IF(Accueil!$D$11<>\"\",Accueil!$D$11,\"\")","v":""}]
[]
["Consultation IST"]
[]
["Période","Trimestre 1",null,null,null,"Stratégie"]
["Bénéficiaires","PS"]
[]
[null,"15-19",null,"20-29",null,"30-39",null,"40-49",null,"50et+"]
[null,"M","F","M","F","M","F","M","F","M","F"]
["Ecoul. Urétral",{"$f":"IF(AND($B$9<>\"Tous\",$G$8<>\"\"),COUNTIFS(Registre_IST!$Z:$Z,Rap_Trim!$B$8,Registre_IST!$L:$L,Rap_Trim!$B$9,Registre_IST!$O:$O,Rap_Trim!$A13,Registre_IST!$G:$G,Rap_Trim!$B$11,Registre_IST!$I:$I,Rap_Trim!B$12,Registre_IST!$X:$X,Rap_Trim!$G$8),IF(AND($B$9=\"Tous\",$G$8<>\"\"),COUNTIFS(Registre_IST!$Z:$Z,Rap_Trim!$B$8,Registre_IST!$O:$O,Rap_Trim!$A13,Registre_IST!$G:$G,Rap_Trim!$B$11,Registre_IST!$I:$I,Rap_Trim!B$12,Registre_IST!$X:$X,Rap_Trim!$G$8),IF(AND($B$9=\"Tous\",$G$8=\"\"),COUNTIFS(Registre_IST!$Z:$Z,Rap_Trim!$B$8,Registre_IST!$O:$O,Rap_Trim!$A13,Registre_IST!$G:$G,Rap_Trim!$B$11,Registre_IST!$I:$I,Rap_Trim!B$12),IF(AND($B$9<>\"Tous\",$G$8=\"\"),COUNTIFS(Registre_IST!$L:$L,Rap_Trim!$B$9,Registre_IST!$Z:$Z,Rap_Trim!$B$8,Registre_IST!$O:$O,Rap_Trim!$A13,Registre_IST!$G:$G,Rap_Trim!$B$11,Registre_IST!$I:$I,Rap_Trim!B$12)))))","v":0},{"$f":"IF(AND($B$9<>\"Tous\",$G$8<>\"\"),COUNTIFS(Registre_IST!$Z:$Z,Rap_Trim!$B$8,Registre_IST!$L:$L,Rap_Trim!$B$9,Registre_IST!$O:$O,Rap_Trim!$A13,Registre_IST!$G:$G,Rap_Trim!$B$11,Registre_IST!$I:$I,Rap_Trim!C$12,Registre_IST!$X:$X,Rap_Trim!$G$8),IF(AND($B$9=\"Tous\",$G$8<>\"\"),COUNTIFS(Registre_IST!$Z:$Z,Rap_Trim!$B$8,Registre_IST!$O:$O,Rap_Trim!$A13,Registre_IST!$G:$G,Rap_Trim!$B$11,Registre_IST!$I:$I,Rap_Trim!C$12,Registre_IST!$X:$X,Rap_Trim!$G$8),IF(AND($B$9=\"Tous\",$G$8=\"\"),COUNTIFS(Registre_IST!$Z:$Z,Rap_Trim!$B$8,Registre_IST!$O:$O,Rap_Trim!$A13,Registre_IST!$G:$G,Rap_Trim!$B$11,Registre_IST!$I:$I,Rap_Trim!C$12),IF(AND($B$9<>\"Tous\",$G$8=\"\"),COUNTIFS(Registre_IST!$L:$L,Rap_Trim!$B$9,Registre_IST!$Z:$Z,Rap_Trim!$B$8,Registre_IST!$O:$O,Rap_Trim!$A13,Registre_IST!$G:$G,Rap_Trim!$B$11,Registre_IST!$I:$I,Rap_Trim!C$12)))))","v":0},{"$f":"IF(AND($B$9<>\"Tous\",$G$8<>\"\"),COUNTIFS(Registre_IST!$Z:$Z,Rap_Trim!$B$8,Registre_IST!$L:$L,Rap_Trim!$B$9,Registre_IST!$O:$O,Rap_Trim!$A13,Registre_IST!$G:$G,Rap_Trim!$D$11,Registre_IST!$I:$I,Rap_Trim!D$12,Registre_IST!$X:$X,Rap_Trim!$G$8),IF(AND($B$9=\"Tous\",$G$8<>\"\"),COUNTIFS(Registre_IST!$Z:$Z,Rap_Trim!$B$8,Registre_IST!$O:$O,Rap_Trim!$A13,Registre_IST!$G:$G,Rap_Trim!$D$11,Registre_IST!$I:$I,Rap_Trim!D$12,Registre_IST!$X:$X,Rap_Trim!$G$8),IF(AND($B$9=\"Tous\",$G$8=\"\"),COUNTIFS(Registre_IST!$Z:$Z,Rap_Trim!$B$8,Registre_IST!$O:$O,Rap_Trim!$A13,Registre_IST!$G:$G,Rap_Trim!$D$11,Registre_IST!$I:$I,Rap_Trim!D$12),IF(AND($B$9<>\"Tous\",$G$8=\"\"),COUNTIFS(Registre_IST!$L:$L,Rap_Trim!$B$9,Registre_IST!$Z:$Z,Rap_Trim!$B$8,Registre_IST!$O:$O,Rap_Trim!$A13,Registre_IST!$G:$G,Rap_Trim!$D$11,Registre_IST!$I:$I,Rap_Trim!D$12)))))","v":0},{"$f":"IF(AND($B$9<>\"Tous\",$G$8<>\"\"),COUNTIFS(Registre_IST!$Z:$Z,Rap_Trim!$B$8,Registre_IST!$L:$L,Rap_Trim!$B$9,Registre_IST!$O:$O,Rap_Trim!$A13,Registre_IST!$G:$G,Rap_Trim!$D$11,Registre_IST!$I:$I,Rap_Trim!E$12,Registre_IST!$X:$X,Rap_Trim!$G$8),IF(AND($B$9=\"Tous\",$G$8<>\"\"),COUNTIFS(Registre_IST!$Z:$Z,Rap_Trim!$B$8,Registre_IST!$O:$O,Rap_Trim!$A13,Registre_IST!$G:$G,Rap_Trim!$D$11,Registre_IST!$I:$I,Rap_Trim!E$12,Registre_IST!$X:$X,Rap_Trim!$G$8),IF(AND($B$9=\"Tous\",$G$8=\"\"),COUNTIFS(Registre_IST!$Z:$Z,Rap_Trim!$B$8,Registre_IST!$O:$O,Rap_Trim!$A13,Registre_IST!$G:$G,Rap_Trim!$D$11,Registre_IST!$I:$I,Rap_Trim!E$12),IF(AND($B$9<>\"Tous\",$G$8=\"\"),COUNTIFS(Registre_IST!$L:$L,Rap_Trim!$B$9,Registre_IST!$Z:$Z,Rap_Trim!$B$8,Registre_IST!$O:$O,Rap_Trim!$A13,Registre_IST!$G:$G,Rap_Trim!$D$11,Registre_IST!$I:$I,Rap_Trim!E$12)))))","v":0},{"$f":"IF(AND($B$9<>\"Tous\",$G$8<>\"\"),COUNTIFS(Registre_IST!$Z:$Z,Rap_Trim!$B$8,Registre_IST!$L:$L,Rap_Trim!$B$9,Registre_IST!$O:$O,Rap_Trim!$A13,Registre_IST!$G:$G,Rap_Trim!$F$11,Registre_IST!$I:$I,Rap_Trim!F$12,Registre_IST!$X:$X,Rap_Trim!$G$8),IF(AND($B$9=\"Tous\",$G$8<>\"\"),COUNTIFS(Registre_IST!$Z:$Z,Rap_Trim!$B$8,Registre_IST!$O:$O,Rap_Trim!$A13,Registre_IST!$G:$G,Rap_Trim!$F$11,Registre_IST!$I:$I,Rap_Trim!F$12,Registre_IST!$X:$X,Rap_Trim!$G$8),IF(AND($B$9=\"Tous\",$G$8=\"\"),COUNTIFS(Registre_IST!$Z:$Z,Rap_Trim!$B$8,Registre_IST!$O:$O,Rap_Trim!$A13,Registre_IST!$G:$G,Rap_Trim!$F$11,Registre_IST!$I:$I,Rap_Trim!F$12),IF(AND($B$9<>\"Tous\",$G$8=\"\"),COUNTIFS(Registre_IST!$L:$L,Rap_Trim!$B$9,Registre_IST!$Z:$Z,Rap_Trim!$B$8,Registre_IST!$O:$O,Rap_Trim!$A13,Registre_IST!$G:$G,Rap_Trim!$F$11,Registre_IST!$I:$I,Rap_Trim!F$12)))))","v":0},{"$f":"IF(AND($B$9<>\"Tous\",$G$8<>\"\"),COUNTIFS(Registre_IST!$Z:$Z,Rap_Trim!$B$8,Registre_IST!$L:$L,Rap_Trim!$B$9,Registre_IST!$O:$O,Rap_Trim!$A13,Registre_IST!$G:$G,Rap_Trim!$F$11,Registre_IST!$I:$I,Rap_Trim!G$12,Registre_IST!$X:$X,Rap_Trim!$G$8),IF(AND($B$9=\"Tous\",$G$8<>\"\"),COUNTIFS(Registre_IST!$Z:$Z,Rap_Trim!$B$8,Registre_IST!$O:$O,Rap_Trim!$A13,Registre_IST!$G:$G,Rap_Trim!$F$11,Registre_IST!$I:$I,Rap_Trim!G$12,Registre_IST!$X:$X,Rap_Trim!$G$8),IF(AND($B$9=\"Tous\",$G$8=\"\"),COUNTIFS(Registre_IST!$Z:$Z,Rap_Trim!$B$8,Registre_IST!$O:$O,Rap_Trim!$A13,Registre_IST!$G:$G,Rap_Trim!$F$11,Registre_IST!$I:$I,Rap_Trim!G$12),IF(AND($B$9<>\"Tous\",$G$8=\"\"),COUNTIFS(Registre_IST!$L:$L,Rap_Trim!$B$9,Registre_IST!$Z:$Z,Rap_Trim!$B$8,Registre_IST!$O:$O,Rap_Trim!$A13,Registre_IST!$G:$G,Rap_Trim!$F$11,Registre_IST!$I:$I,Rap_Trim!G$12)))))","v":0},{"$f":"IF(AND($B$9<>\"Tous\",$G$8<>\"\"),COUNTIFS(Registre_IST!$Z:$Z,Rap_Trim!$B$8,Registre_IST!$L:$L,Rap_Trim!$B$9,Registre_IST!$O:$O,Rap_Trim!$A13,Registre_IST!$G:$G,Rap_Trim!$H$11,Registre_IST!$I:$I,Rap_Trim!H$12,Registre_IST!$X:$X,Rap_Trim!$G$8),IF(AND($B$9=\"Tous\",$G$8<>\"\"),COUNTIFS(Registre_IST!$Z:$Z,Rap_Trim!$B$8,Registre_IST!$O:$O,Rap_Trim!$A13,Registre_IST!$G:$G,Rap_Trim!$H$11,Registre_IST!$I:$I,Rap_Trim!H$12,Registre_IST!$X:$X,Rap_Trim!$G$8),IF(AND($B$9=\"Tous\",$G$8=\"\"),COUNTIFS(Registre_IST!$Z:$Z,Rap_Trim!$B$8,Registre_IST!$O:$O,Rap_Trim!$A13,Registre_IST!$G:$G,Rap_Trim!$H$11,Registre_IST!$I:$I,Rap_Trim!H$12),IF(AND($B$9<>\"Tous\",$G$8=\"\"),COUNTIFS(Registre_IST!$L:$L,Rap_Trim!$B$9,Registre_IST!$Z:$Z,Rap_Trim!$B$8,Registre_IST!$O:$O,Rap_Trim!$A13,Registre_IST!$G:$G,Rap_Trim!$H$11,Registre_IST!$I:$I,Rap_Trim!H$12)))))","v":0},{"$f":"IF(AND($B$9<>\"Tous\",$G$8<>\"\"),COUNTIFS(Registre_IST!$Z:$Z,Rap_Trim!$B$8,Registre_IST!$L:$L,Rap_Trim!$B$9,Registre_IST!$O:$O,Rap_Trim!$A13,Registre_IST!$G:$G,Rap_Trim!$H$11,Registre_IST!$I:$I,Rap_Trim!I$12,Registre_IST!$X:$X,Rap_Trim!$G$8),IF(AND($B$9=\"Tous\",$G$8<>\"\"),COUNTIFS(Registre_IST!$Z:$Z,Rap_Trim!$B$8,Registre_IST!$O:$O,Rap_Trim!$A13,Registre_IST!$G:$G,Rap_Trim!$H$11,Registre_IST!$I:$I,Rap_Trim!I$12,Registre_IST!$X:$X,Rap_Trim!$G$8),IF(AND($B$9=\"Tous\",$G$8=\"\"),COUNTIFS(Registre_IST!$Z:$Z,Rap_Trim!$B$8,Registre_IST!$O:$O,Rap_Trim!$A13,Registre_IST!$G:$G,Rap_Trim!$H$11,Registre_IST!$I:$I,Rap_Trim!I$12),IF(AND($B$9<>\"Tous\",$G$8=\"\"),COUNTIFS(Registre_IST!$L:$L,Rap_Trim!$B$9,Registre_IST!$Z:$Z,Rap_Trim!$B$8,Registre_IST!$O:$O,Rap_Trim!$A13,Registre_IST!$G:$G,Rap_Trim!$H$11,Registre_IST!$I:$I,Rap_Trim!I$12)))))","v":0},{"$f":"IF(AND($B$9<>\"Tous\",$G$8<>\"\"),COUNTIFS(Registre_IST!$Z:$Z,Rap_Trim!$B$8,Registre_IST!$L:$L,Rap_Trim!$B$9,Registre_IST!$O:$O,Rap_Trim!$A13,Registre_IST!$G:$G,Rap_Trim!$J$11,Registre_IST!$I:$I,Rap_Trim!J$12,Registre_IST!$X:$X,Rap_Trim!$G$8),IF(AND($B$9=\"Tous\",$G$8<>\"\"),COUNTIFS(Registre_IST!$Z:$Z,Rap_Trim!$B$8,Registre_IST!$O:$O,Rap_Trim!$A13,Registre_IST!$G:$G,Rap_Trim!$J$11,Registre_IST!$I:$I,Rap_Trim!J$12,Registre_IST!$X:$X,Rap_Trim!$G$8),IF(AND($B$9=\"Tous\",$G$8=\"\"),COUNTIFS(Registre_IST!$Z:$Z,Rap_Trim!$B$8,Registre_IST!$O:$O,Rap_Trim!$A13,Registre_IST!$G:$G,Rap_Trim!$J$11,Registre_IST!$I:$I,Rap_Trim!J$12),IF(AND($B$9<>\"Tous\",$G$8=\"\"),COUNTIFS(Registre_IST!$L:$L,Rap_Trim!$B$9,Registre_IST!$Z:$Z,Rap_Trim!$B$8,Registre_IST!$O:$O,Rap_Trim!$A13,Registre_IST!$G:$G,Rap_Trim!$J$11,Registre_IST!$I:$I,Rap_Trim!J$12)))))","v":0},{"$f":"IF(AND($B$9<>\"Tous\",$G$8<>\"\"),COUNTIFS(Registre_IST!$Z:$Z,Rap_Trim!$B$8,Registre_IST!$L:$L,Rap_Trim!$B$9,Registre_IST!$O:$O,Rap_Trim!$A13,Registre_IST!$G:$G,Rap_Trim!$J$11,Registre_IST!$I:$I,Rap_Trim!K$12,Registre_IST!$X:$X,Rap_Trim!$G$8),IF(AND($B$9=\"Tous\",$G$8<>\"\"),COUNTIFS(Registre_IST!$Z:$Z,Rap_Trim!$B$8,Registre_IST!$O:$O,Rap_Trim!$A13,Registre_IST!$G:$G,Rap_Trim!$J$11,Registre_IST!$I:$I,Rap_Trim!K$12,Registre_IST!$X:$X,Rap_Trim!$G$8),IF(AND($B$9=\"Tous\",$G$8=\"\"),COUNTIFS(Registre_IST!$Z:$Z,Rap_Trim!$B$8,Registre_IST!$O:$O,Rap_Trim!$A13,Registre_IST!$G:$G,Rap_Trim!$J$11,Registre_IST!$I:$I,Rap_Trim!K$12),IF(AND($B$9<>\"Tous\",$G$8=\"\"),COUNTIFS(Registre_IST!$L:$L,Rap_Trim!$B$9,Registre_IST!$Z:$Z,Rap_Trim!$B$8,Registre_IST!$O:$O,Rap_Trim!$A13,Registre_IST!$G:$G,Rap_Trim!$J$11,Registre_IST!$I:$I,Rap_Trim!K$12)))))","v":0}]
["Vaginite",{"$f":"IF(AND($B$9<>\"Tous\",$G$8<>\"\"),COUNTIFS(Registre_IST!$Z:$Z,Rap_Trim!$B$8,Registre_IST!$L:$L,Rap_Trim!$B$9,Registre_IST!$O:$O,Rap_Trim!$A14,Registre_IST!$G:$G,Rap_Trim!$B$11,Registre_IST!$I:$I,Rap_Trim!B$12,Registre_IST!$X:$X,Rap_Trim!$G$8),IF(AND($B$9=\"Tous\",$G$8<>\"\"),COUNTIFS(Registre_IST!$Z:$Z,Rap_Trim!$B$8,Registre_IST!$O:$O,Rap_Trim!$A14,Registre_IST!$G:$G,Rap_Trim!$B$11,Registre_IST!$I:$I,Rap_Trim!B$12,Registre_IST!$X:$X,Rap_Trim!$G$8),IF(AND($B$9=\"Tous\",$G$8=\"\"),COUNTIFS(Registre_IST!$Z:$Z,Rap_Trim!$B$8,Registre_IST!$O:$O,Rap_Trim!$A14,Registre_IST!$G:$G,Rap_Trim!$B$11,Registre_IST!$I:$I,Rap_Trim!B$12),IF(AND($B$9<>\"Tous\",$G$8=\"\"),COUNTIFS(Registre_IST!$L:$L,Rap_Trim!$B$9,Registre_IST!$Z:$Z,Rap_Trim!$B$8,Registre_IST!$O:$O,Rap_Trim!$A14,Registre_IST!$G:$G,Rap_Trim!$B$11,Registre_IST!$I:$I,Rap_Trim!B$12)))))","v":0},{"$f":"IF(AND($B$9<>\"Tous\",$G$8<>\"\"),COUNTIFS(Registre_IST!$Z:$Z,Rap_Trim!$B$8,Registre_IST!$L:$L,Rap_Trim!$B$9,Registre_IST!$O:$O,Rap_Trim!$A14,Registre_IST!$G:$G,Rap_Trim!$B$11,Registre_IST!$I:$I,Rap_Trim!C$12,Registre_IST!$X:$X,Rap_Trim!$G$8),IF(AND($B$9=\"Tous\",$G$8<>\"\"),COUNTIFS(Registre_IST!$Z:$Z,Rap_Trim!$B$8,Registre_IST!$O:$O,Rap_Trim!$A14,Registre_IST!$G:$G,Rap_Trim!$B$11,Registre_IST!$I:$I,Rap_Trim!C$12,Registre_IST!$X:$X,Rap_Trim!$G$8),IF(AND($B$9=\"Tous\",$G$8=\"\"),COUNTIFS(Registre_IST!$Z:$Z,Rap_Trim!$B$8,Registre_IST!$O:$O,Rap_Trim!$A14,Registre_IST!$G:$G,Rap_Trim!$B$11,Registre_IST!$I:$I,Rap_Trim!C$12),IF(AND($B$9<>\"Tous\",$G$8=\"\"),COUNTIFS(Registre_IST!$L:$L,Rap_Trim!$B$9,Registre_IST!$Z:$Z,Rap_Trim!$B$8,Registre_IST!$O:$O,Rap_Trim!$A14,Registre_IST!$G:$G,Rap_Trim!$B$11,Registre_IST!$I:$I,Rap_Trim!C$12)))))","v":0},{"$f":"IF(AND($B$9<>\"Tous\",$G$8<>\"\"),COUNTIFS(Registre_IST!$Z:$Z,Rap_Trim!$B$8,Registre_IST!$L:$L,Rap_Trim!$B$9,Registre_IST!$O:$O,Rap_Trim!$A14,Registre_IST!$G:$G,Rap_Trim!$D$11,Registre_IST!$I:$I,Rap_Trim!D$12,Registre_IST!$X:$X,Rap_Trim!$G$8),IF(AND($B$9=\"Tous\",$G$8<>\"\"),COUNTIFS(Registre_IST!$Z:$Z,Rap_Trim!$B$8,Registre_IST!$O:$O,Rap_Trim!$A14,Registre_IST!$G:$G,Rap_Trim!$D$11,Registre_IST!$I:$I,Rap_Trim!D$12,Registre_IST!$X:$X,Rap_Trim!$G$8),IF(AND($B$9=\"Tous\",$G$8=\"\"),COUNTIFS(Registre_IST!$Z:$Z,Rap_Trim!$B$8,Registre_IST!$O:$O,Rap_Trim!$A14,Registre_IST!$G:$G,Rap_Trim!$D$11,Registre_IST!$I:$I,Rap_Trim!D$12),IF(AND($B$9<>\"Tous\",$G$8=\"\"),COUNTIFS(Registre_IST!$L:$L,Rap_Trim!$B$9,Registre_IST!$Z:$Z,Rap_Trim!$B$8,Registre_IST!$O:$O,Rap_Trim!$A14,Registre_IST!$G:$G,Rap_Trim!$D$11,Registre_IST!$I:$I,Rap_Trim!D$12)))))","v":0},{"$f":"IF(AND($B$9<>\"Tous\",$G$8<>\"\"),COUNTIFS(Registre_IST!$Z:$Z,Rap_Trim!$B$8,Registre_IST!$L:$L,Rap_Trim!$B$9,Registre_IST!$O:$O,Rap_Trim!$A14,Registre_IST!$G:$G,Rap_Trim!$D$11,Registre_IST!$I:$I,Rap_Trim!E$12,Registre_IST!$X:$X,Rap_Trim!$G$8),IF(AND($B$9=\"Tous\",$G$8<>\"\"),COUNTIFS(Registre_IST!$Z:$Z,Rap_Trim!$B$8,Registre_IST!$O:$O,Rap_Trim!$A14,Registre_IST!$G:$G,Rap_Trim!$D$11,Registre_IST!$I:$I,Rap_Trim!E$12,Registre_IST!$X:$X,Rap_Trim!$G$8),IF(AND($B$9=\"Tous\",$G$8=\"\"),COUNTIFS(Registre_IST!$Z:$Z,Rap_Trim!$B$8,Registre_IST!$O:$O,Rap_Trim!$A14,Registre_IST!$G:$G,Rap_Trim!$D$11,Registre_IST!$I:$I,Rap_Trim!E$12),IF(AND($B$9<>\"Tous\",$G$8=\"\"),COUNTIFS(Registre_IST!$L:$L,Rap_Trim!$B$9,Registre_IST!$Z:$Z,Rap_Trim!$B$8,Registre_IST!$O:$O,Rap_Trim!$A14,Registre_IST!$G:$G,Rap_Trim!$D$11,Registre_IST!$I:$I,Rap_Trim!E$12)))))","v":0},{"$f":"IF(AND($B$9<>\"Tous\",$G$8<>\"\"),COUNTIFS(Registre_IST!$Z:$Z,Rap_Trim!$B$8,Registre_IST!$L:$L,Rap_Trim!$B$9,Registre_IST!$O:$O,Rap_Trim!$A14,Registre_IST!$G:$G,Rap_Trim!$F$11,Registre_IST!$I:$I,Rap_Trim!F$12,Registre_IST!$X:$X,Rap_Trim!$G$8),IF(AND($B$9=\"Tous\",$G$8<>\"\"),COUNTIFS(Registre_IST!$Z:$Z,Rap_Trim!$B$8,Registre_IST!$O:$O,Rap_Trim!$A14,Registre_IST!$G:$G,Rap_Trim!$F$11,Registre_IST!$I:$I,Rap_Trim!F$12,Registre_IST!$X:$X,Rap_Trim!$G$8),IF(AND($B$9=\"Tous\",$G$8=\"\"),COUNTIFS(Registre_IST!$Z:$Z,Rap_Trim!$B$8,Registre_IST!$O:$O,Rap_Trim!$A14,Registre_IST!$G:$G,Rap_Trim!$F$11,Registre_IST!$I:$I,Rap_Trim!F$12),IF(AND($B$9<>\"Tous\",$G$8=\"\"),COUNTIFS(Registre_IST!$L:$L,Rap_Trim!$B$9,Registre_IST!$Z:$Z,Rap_Trim!$B$8,Registre_IST!$O:$O,Rap_Trim!$A14,Registre_IST!$G:$G,Rap_Trim!$F$11,Registre_IST!$I:$I,Rap_Trim!F$12)))))","v":0},{"$f":"IF(AND($B$9<>\"Tous\",$G$8<>\"\"),COUNTIFS(Registre_IST!$Z:$Z,Rap_Trim!$B$8,Registre_IST!$L:$L,Rap_Trim!$B$9,Registre_IST!$O:$O,Rap_Trim!$A14,Registre_IST!$G:$G,Rap_Trim!$F$11,Registre_IST!$I:$I,Rap_Trim!G$12,Registre_IST!$X:$X,Rap_Trim!$G$8),IF(AND($B$9=\"Tous\",$G$8<>\"\"),COUNTIFS(Registre_IST!$Z:$Z,Rap_Trim!$B$8,Registre_IST!$O:$O,Rap_Trim!$A14,Registre_IST!$G:$G,Rap_Trim!$F$11,Registre_IST!$I:$I,Rap_Trim!G$12,Registre_IST!$X:$X,Rap_Trim!$G$8),IF(AND($B$9=\"Tous\",$G$8=\"\"),COUNTIFS(Registre_IST!$Z:$Z,Rap_Trim!$B$8,Registre_IST!$O:$O,Rap_Trim!$A14,Registre_IST!$G:$G,Rap_Trim!$F$11,Registre_IST!$I:$I,Rap_Trim!G$12),IF(AND($B$9<>\"Tous\",$G$8=\"\"),COUNTIFS(Registre_IST!$L:$L,Rap_Trim!$B$9,Registre_IST!$Z:$Z,Rap_Trim!$B$8,Registre_IST!$O:$O,Rap_Trim!$A14,Registre_IST!$G:$G,Rap_Trim!$F$11,Registre_IST!$I:$I,Rap_Trim!G$12)))))","v":0},{"$f":"IF(AND($B$9<>\"Tous\",$G$8<>\"\"),COUNTIFS(Registre_IST!$Z:$Z,Rap_Trim!$B$8,Registre_IST!$L:$L,Rap_Trim!$B$9,Registre_IST!$O:$O,Rap_Trim!$A14,Registre_IST!$G:$G,Rap_Trim!$H$11,Registre_IST!$I:$I,Rap_Trim!H$12,Registre_IST!$X:$X,Rap_Trim!$G$8),IF(AND($B$9=\"Tous\",$G$8<>\"\"),COUNTIFS(Registre_IST!$Z:$Z,Rap_Trim!$B$8,Registre_IST!$O:$O,Rap_Trim!$A14,Registre_IST!$G:$G,Rap_Trim!$H$11,Registre_IST!$I:$I,Rap_Trim!H$12,Registre_IST!$X:$X,Rap_Trim!$G$8),IF(AND($B$9=\"Tous\",$G$8=\"\"),COUNTIFS(Registre_IST!$Z:$Z,Rap_Trim!$B$8,Registre_IST!$O:$O,Rap_Trim!$A14,Registre_IST!$G:$G,Rap_Trim!$H$11,Registre_IST!$I:$I,Rap_Trim!H$12),IF(AND($B$9<>\"Tous\",$G$8=\"\"),COUNTIFS(Registre_IST!$L:$L,Rap_Trim!$B$9,Registre_IST!$Z:$Z,Rap_Trim!$B$8,Registre_IST!$O:$O,Rap_Trim!$A14,Registre_IST!$G:$G,Rap_Trim!$H$11,Registre_IST!$I:$I,Rap_Trim!H$12)))))","v":0},{"$f":"IF(AND($B$9<>\"Tous\",$G$8<>\"\"),COUNTIFS(Registre_IST!$Z:$Z,Rap_Trim!$B$8,Registre_IST!$L:$L,Rap_Trim!$B$9,Registre_IST!$O:$O,Rap_Trim!$A14,Registre_IST!$G:$G,Rap_Trim!$H$11,Registre_IST!$I:$I,Rap_Trim!I$12,Registre_IST!$X:$X,Rap_Trim!$G$8),IF(AND($B$9=\"Tous\",$G$8<>\"\"),COUNTIFS(Registre_IST!$Z:$Z,Rap_Trim!$B$8,Registre_IST!$O:$O,Rap_Trim!$A14,Registre_IST!$G:$G,Rap_Trim!$H$11,Registre_IST!$I:$I,Rap_Trim!I$12,Registre_IST!$X:$X,Rap_Trim!$G$8),IF(AND($B$9=\"Tous\",$G$8=\"\"),COUNTIFS(Registre_IST!$Z:$Z,Rap_Trim!$B$8,Registre_IST!$O:$O,Rap_Trim!$A14,Registre_IST!$G:$G,Rap_Trim!$H$11,Registre_IST!$I:$I,Rap_Trim!I$12),IF(AND($B$9<>\"Tous\",$G$8=\"\"),COUNTIFS(Registre_IST!$L:$L,Rap_Trim!$B$9,Registre_IST!$Z:$Z,Rap_Trim!$B$8,Registre_IST!$O:$O,Rap_Trim!$A14,Registre_IST!$G:$G,Rap_Trim!$H$11,Registre_IST!$I:$I,Rap_Trim!I$12)))))","v":0},{"$f":"IF(AND($B$9<>\"Tous\",$G$8<>\"\"),COUNTIFS(Registre_IST!$Z:$Z,Rap_Trim!$B$8,Registre_IST!$L:$L,Rap_Trim!$B$9,Registre_IST!$O:$O,Rap_Trim!$A14,Registre_IST!$G:$G,Rap_Trim!$J$11,Registre_IST!$I:$I,Rap_Trim!J$12,Registre_IST!$X:$X,Rap_Trim!$G$8),IF(AND($B$9=\"Tous\",$G$8<>\"\"),COUNTIFS(Registre_IST!$Z:$Z,Rap_Trim!$B$8,Registre_IST!$O:$O,Rap_Trim!$A14,Registre_IST!$G:$G,Rap_Trim!$J$11,Registre_IST!$I:$I,Rap_Trim!J$12,Registre_IST!$X:$X,Rap_Trim!$G$8),IF(AND($B$9=\"Tous\",$G$8=\"\"),COUNTIFS(Registre_IST!$Z:$Z,Rap_Trim!$B$8,Registre_IST!$O:$O,Rap_Trim!$A14,Registre_IST!$G:$G,Rap_Trim!$J$11,Registre_IST!$I:$I,Rap_Trim!J$12),IF(AND($B$9<>\"Tous\",$G$8=\"\"),COUNTIFS(Registre_IST!$L:$L,Rap_Trim!$B$9,Registre_IST!$Z:$Z,Rap_Trim!$B$8,Registre_IST!$O:$O,Rap_Trim!$A14,Registre_IST!$G:$G,Rap_Trim!$J$11,Registre_IST!$I:$I,Rap_Trim!J$12)))))","v":0},{"$f":"IF(AND($B$9<>\"Tous\",$G$8<>\"\"),COUNTIFS(Registre_IST!$Z:$Z,Rap_Trim!$B$8,Registre_IST!$L:$L,Rap_Trim!$B$9,Registre_IST!$O:$O,Rap_Trim!$A14,Registre_IST!$G:$G,Rap_Trim!$J$11,Registre_IST!$I:$I,Rap_Trim!K$12,Registre_IST!$X:$X,Rap_Trim!$G$8),IF(AND($B$9=\"Tous\",$G$8<>\"\"),COUNTIFS(Registre_IST!$Z:$Z,Rap_Trim!$B$8,Registre_IST!$O:$O,Rap_Trim!$A14,Registre_IST!$G:$G,Rap_Trim!$J$11,Registre_IST!$I:$I,Rap_Trim!K$12,Registre_IST!$X:$X,Rap_Trim!$G$8),IF(AND($B$9=\"Tous\",$G$8=\"\"),COUNTIFS(Registre_IST!$Z:$Z,Rap_Trim!$B$8,Registre_IST!$O:$O,Rap_Trim!$A14,Registre_IST!$G:$G,Rap_Trim!$J$11,Registre_IST!$I:$I,Rap_Trim!K$12),IF(AND($B$9<>\"Tous\",$G$8=\"\"),COUNTIFS(Registre_IST!$L:$L,Rap_Trim!$B$9,Registre_IST!$Z:$Z,Rap_Trim!$B$8,Registre_IST!$O:$O,Rap_Trim!$A14,Registre_IST!$G:$G,Rap_Trim!$J$11,Registre_IST!$I:$I,Rap_Trim!K$12)))))","v":0}]
["Cervicite",{"$f":"IF(AND($B$9<>\"Tous\",$G$8<>\"\"),COUNTIFS(Registre_IST!$Z:$Z,Rap_Trim!$B$8,Registre_IST!$L:$L,Rap_Trim!$B$9,Registre_IST!$O:$O,Rap_Trim!$A15,Registre_IST!$G:$G,Rap_Trim!$B$11,Registre_IST!$I:$I,Rap_Trim!B$12,Registre_IST!$X:$X,Rap_Trim!$G$8),IF(AND($B$9=\"Tous\",$G$8<>\"\"),COUNTIFS(Registre_IST!$Z:$Z,Rap_Trim!$B$8,Registre_IST!$O:$O,Rap_Trim!$A15,Registre_IST!$G:$G,Rap_Trim!$B$11,Registre_IST!$I:$I,Rap_Trim!B$12,Registre_IST!$X:$X,Rap_Trim!$G$8),IF(AND($B$9=\"Tous\",$G$8=\"\"),COUNTIFS(Registre_IST!$Z:$Z,Rap_Trim!$B$8,Registre_IST!$O:$O,Rap_Trim!$A15,Registre_IST!$G:$G,Rap_Trim!$B$11,Registre_IST!$I:$I,Rap_Trim!B$12),IF(AND($B$9<>\"Tous\",$G$8=\"\"),COUNTIFS(Registre_IST!$L:$L,Rap_Trim!$B$9,Registre_IST!$Z:$Z,Rap_Trim!$B$8,Registre_IST!$O:$O,Rap_Trim!$A15,Registre_IST!$G:$G,Rap_Trim!$B$11,Registre_IST!$I:$I,Rap_Trim!B$12)))))","v":0},{"$f":"IF(AND($B$9<>\"Tous\",$G$8<>\"\"),COUNTIFS(Registre_IST!$Z:$Z,Rap_Trim!$B$8,Registre_IST!$L:$L,Rap_Trim!$B$9,Registre_IST!$O:$O,Rap_Trim!$A15,Registre_IST!$G:$G,Rap_Trim!$B$11,Registre_IST!$I:$I,Rap_Trim!C$12,Registre_IST!$X:$X,Rap_Trim!$G$8),IF(AND($B$9=\"Tous\",$G$8<>\"\"),COUNTIFS(Registre_IST!$Z:$Z,Rap_Trim!$B$8,Registre_IST!$O:$O,Rap_Trim!$A15,Registre_IST!$G:$G,Rap_Trim!$B$11,Registre_IST!$I:$I,Rap_Trim!C$12,Registre_IST!$X:$X,Rap_Trim!$G$8),IF(AND($B$9=\"Tous\",$G$8=\"\"),COUNTIFS(Registre_IST!$Z:$Z,Rap_Trim!$B$8,Registre_IST!$O:$O,Rap_Trim!$A15,Registre_IST!$G:$G,Rap_Trim!$B$11,Registre_IST!$I:$I,Rap_Trim!C$12),IF(AND($B$9<>\"Tous\",$G$8=\"\"),COUNTIFS(Registre_IST!$L:$L,Rap_Trim!$B$9,Registre_IST!$Z:$Z,Rap_Trim!$B$8,Registre_IST!$O:$O,Rap_Trim!$A15,Registre_IST!$G:$G,Rap_Trim!$B$11,Registre_IST!$I:$I,Rap_Trim!C$12)))))","v":0},{"$f":"IF(AND($B$9<>\"Tous\",$G$8<>\"\"),COUNTIFS(Registre_IST!$Z:$Z,Rap_Trim!$B$8,Registre_IST!$L:$L,Rap_Trim!$B$9,Registre_IST!$O:$O,Rap_Trim!$A15,Registre_IST!$G:$G,Rap_Trim!$D$11,Registre_IST!$I:$I,Rap_Trim!D$12,Registre_IST!$X:$X,Rap_Trim!$G$8),IF(AND($B$9=\"Tous\",$G$8<>\"\"),COUNTIFS(Registre_IST!$Z:$Z,Rap_Trim!$B$8,Registre_IST!$O:$O,Rap_Trim!$A15,Registre_IST!$G:$G,Rap_Trim!$D$11,Registre_IST!$I:$I,Rap_Trim!D$12,Registre_IST!$X:$X,Rap_Trim!$G$8),IF(AND($B$9=\"Tous\",$G$8=\"\"),COUNTIFS(Registre_IST!$Z:$Z,Rap_Trim!$B$8,Registre_IST!$O:$O,Rap_Trim!$A15,Registre_IST!$G:$G,Rap_Trim!$D$11,Registre_IST!$I:$I,Rap_Trim!D$12),IF(AND($B$9<>\"Tous\",$G$8=\"\"),COUNTIFS(Registre_IST!$L:$L,Rap_Trim!$B$9,Registre_IST!$Z:$Z,Rap_Trim!$B$8,Registre_IST!$O:$O,Rap_Trim!$A15,Registre_IST!$G:$G,Rap_Trim!$D$11,Registre_IST!$I:$I,Rap_Trim!D$12)))))","v":0},{"$f":"IF(AND($B$9<>\"Tous\",$G$8<>\"\"),COUNTIFS(Registre_IST!$Z:$Z,Rap_Trim!$B$8,Registre_IST!$L:$L,Rap_Trim!$B$9,Registre_IST!$O:$O,Rap_Trim!$A15,Registre_IST!$G:$G,Rap_Trim!$D$11,Registre_IST!$I:$I,Rap_Trim!E$12,Registre_IST!$X:$X,Rap_Trim!$G$8),IF(AND($B$9=\"Tous\",$G$8<>\"\"),COUNTIFS(Registre_IST!$Z:$Z,Rap_Trim!$B$8,Registre_IST!$O:$O,Rap_Trim!$A15,Registre_IST!$G:$G,Rap_Trim!$D$11,Registre_IST!$I:$I,Rap_Trim!E$12,Registre_IST!$X:$X,Rap_Trim!$G$8),IF(AND($B$9=\"Tous\",$G$8=\"\"),COUNTIFS(Registre_IST!$Z:$Z,Rap_Trim!$B$8,Registre_IST!$O:$O,Rap_Trim!$A15,Registre_IST!$G:$G,Rap_Trim!$D$11,Registre_IST!$I:$I,Rap_Trim!E$12),IF(AND($B$9<>\"Tous\",$G$8=\"\"),COUNTIFS(Registre_IST!$L:$L,Rap_Trim!$B$9,Registre_IST!$Z:$Z,Rap_Trim!$B$8,Registre_IST!$O:$O,Rap_Trim!$A15,Registre_IST!$G:$G,Rap_Trim!$D$11,Registre_IST!$I:$I,Rap_Trim!E$12)))))","v":0},{"$f":"IF(AND($B$9<>\"Tous\",$G$8<>\"\"),COUNTIFS(Registre_IST!$Z:$Z,Rap_Trim!$B$8,Registre_IST!$L:$L,Rap_Trim!$B$9,Registre_IST!$O:$O,Rap_Trim!$A15,Registre_IST!$G:$G,Rap_Trim!$F$11,Registre_IST!$I:$I,Rap_Trim!F$12,Registre_IST!$X:$X,Rap_Trim!$G$8),IF(AND($B$9=\"Tous\",$G$8<>\"\"),COUNTIFS(Registre_IST!$Z:$Z,Rap_Trim!$B$8,Registre_IST!$O:$O,Rap_Trim!$A15,Registre_IST!$G:$G,Rap_Trim!$F$11,Registre_IST!$I:$I,Rap_Trim!F$12,Registre_IST!$X:$X,Rap_Trim!$G$8),IF(AND($B$9=\"Tous\",$G$8=\"\"),COUNTIFS(Registre_IST!$Z:$Z,Rap_Trim!$B$8,Registre_IST!$O:$O,Rap_Trim!$A15,Registre_IST!$G:$G,Rap_Trim!$F$11,Registre_IST!$I:$I,Rap_Trim!F$12),IF(AND($B$9<>\"Tous\",$G$8=\"\"),COUNTIFS(Registre_IST!$L:$L,Rap_Trim!$B$9,Registre_IST!$Z:$Z,Rap_Trim!$B$8,Registre_IST!$O:$O,Rap_Trim!$A15,Registre_IST!$G:$G,Rap_Trim!$F$11,Registre_IST!$I:$I,Rap_Trim!F$12)))))","v":0},{"$f":"IF(AND($B$9<>\"Tous\",$G$8<>\"\"),COUNTIFS(Registre_IST!$Z:$Z,Rap_Trim!$B$8,Registre_IST!$L:$L,Rap_Trim!$B$9,Registre_IST!$O:$O,Rap_Trim!$A15,Registre_IST!$G:$G,Rap_Trim!$F$11,Registre_IST!$I:$I,Rap_Trim!G$12,Registre_IST!$X:$X,Rap_Trim!$G$8),IF(AND($B$9=\"Tous\",$G$8<>\"\"),COUNTIFS(Registre_IST!$Z:$Z,Rap_Trim!$B$8,Registre_IST!$O:$O,Rap_Trim!$A15,Registre_IST!$G:$G,Rap_Trim!$F$11,Registre_IST!$I:$I,Rap_Trim!G$12,Registre_IST!$X:$X,Rap_Trim!$G$8),IF(AND($B$9=\"Tous\",$G$8=\"\"),COUNTIFS(Registre_IST!$Z:$Z,Rap_Trim!$B$8,Registre_IST!$O:$O,Rap_Trim!$A15,Registre_IST!$G:$G,Rap_Trim!$F$11,Registre_IST!$I:$I,Rap_Trim!G$12),IF(AND($B$9<>\"Tous\",$G$8=\"\"),COUNTIFS(Registre_IST!$L:$L,Rap_Trim!$B$9,Registre_IST!$Z:$Z,Rap_Trim!$B$8,Registre_IST!$O:$O,Rap_Trim!$A15,Registre_IST!$G:$G,Rap_Trim!$F$11,Registre_IST!$I:$I,Rap_Trim!G$12)))))","v":0},{"$f":"IF(AND($B$9<>\"Tous\",$G$8<>\"\"),COUNTIFS(Registre_IST!$Z:$Z,Rap_Trim!$B$8,Registre_IST!$L:$L,Rap_Trim!$B$9,Registre_IST!$O:$O,Rap_Trim!$A15,Registre_IST!$G:$G,Rap_Trim!$H$11,Registre_IST!$I:$I,Rap_Trim!H$12,Registre_IST!$X:$X,Rap_Trim!$G$8),IF(AND($B$9=\"Tous\",$G$8<>\"\"),COUNTIFS(Registre_IST!$Z:$Z,Rap_Trim!$B$8,Registre_IST!$O:$O,Rap_Trim!$A15,Registre_IST!$G:$G,Rap_Trim!$H$11,Registre_IST!$I:$I,Rap_Trim!H$12,Registre_IST!$X:$X,Rap_Trim!$G$8),IF(AND($B$9=\"Tous\",$G$8=\"\"),COUNTIFS(Registre_IST!$Z:$Z,Rap_Trim!$B$8,Registre_IST!$O:$O,Rap_Trim!$A15,Registre_IST!$G:$G,Rap_Trim!$H$11,Registre_IST!$I:$I,Rap_Trim!H$12),IF(AND($B$9<>\"Tous\",$G$8=\"\"),COUNTIFS(Registre_IST!$L:$L,Rap_Trim!$B$9,Registre_IST!$Z:$Z,Rap_Trim!$B$8,Registre_IST!$O:$O,Rap_Trim!$A15,Registre_IST!$G:$G,Rap_Trim!$H$11,Registre_IST!$I:$I,Rap_Trim!H$12)))))","v":0},{"$f":"IF(AND($B$9<>\"Tous\",$G$8<>\"\"),COUNTIFS(Registre_IST!$Z:$Z,Rap_Trim!$B$8,Registre_IST!$L:$L,Rap_Trim!$B$9,Registre_IST!$O:$O,Rap_Trim!$A15,Registre_IST!$G:$G,Rap_Trim!$H$11,Registre_IST!$I:$I,Rap_Trim!I$12,Registre_IST!$X:$X,Rap_Trim!$G$8),IF(AND($B$9=\"Tous\",$G$8<>\"\"),COUNTIFS(Registre_IST!$Z:$Z,Rap_Trim!$B$8,Registre_IST!$O:$O,Rap_Trim!$A15,Registre_IST!$G:$G,Rap_Trim!$H$11,Registre_IST!$I:$I,Rap_Trim!I$12,Registre_IST!$X:$X,Rap_Trim!$G$8),IF(AND($B$9=\"Tous\",$G$8=\"\"),COUNTIFS(Registre_IST!$Z:$Z,Rap_Trim!$B$8,Registre_IST!$O:$O,Rap_Trim!$A15,Registre_IST!$G:$G,Rap_Trim!$H$11,Registre_IST!$I:$I,Rap_Trim!I$12),IF(AND($B$9<>\"Tous\",$G$8=\"\"),COUNTIFS(Registre_IST!$L:$L,Rap_Trim!$B$9,Registre_IST!$Z:$Z,Rap_Trim!$B$8,Registre_IST!$O:$O,Rap_Trim!$A15,Registre_IST!$G:$G,Rap_Trim!$H$11,Registre_IST!$I:$I,Rap_Trim!I$12)))))","v":0},{"$f":"IF(AND($B$9<>\"Tous\",$G$8<>\"\"),COUNTIFS(Registre_IST!$Z:$Z,Rap_Trim!$B$8,Registre_IST!$L:$L,Rap_Trim!$B$9,Registre_IST!$O:$O,Rap_Trim!$A15,Registre_IST!$G:$G,Rap_Trim!$J$11,Registre_IST!$I:$I,Rap_Trim!J$12,Registre_IST!$X:$X,Rap_Trim!$G$8),IF(AND($B$9=\"Tous\",$G$8<>\"\"),COUNTIFS(Registre_IST!$Z:$Z,Rap_Trim!$B$8,Registre_IST!$O:$O,Rap_Trim!$A15,Registre_IST!$G:$G,Rap_Trim!$J$11,Registre_IST!$I:$I,Rap_Trim!J$12,Registre_IST!$X:$X,Rap_Trim!$G$8),IF(AND($B$9=\"Tous\",$G$8=\"\"),COUNTIFS(Registre_IST!$Z:$Z,Rap_Trim!$B$8,Registre_IST!$O:$O,Rap_Trim!$A15,Registre_IST!$G:$G,Rap_Trim!$J$11,Registre_IST!$I:$I,Rap_Trim!J$12),IF(AND($B$9<>\"Tous\",$G$8=\"\"),COUNTIFS(Registre_IST!$L:$L,Rap_Trim!$B$9,Registre_IST!$Z:$Z,Rap_Trim!$B$8,Registre_IST!$O:$O,Rap_Trim!$A15,Registre_IST!$G:$G,Rap_Trim!$J$11,Registre_IST!$I:$I,Rap_Trim!J$12)))))","v":0},{"$f":"IF(AND($B$9<>\"Tous\",$G$8<>\"\"),COUNTIFS(Registre_IST!$Z:$Z,Rap_Trim!$B$8,Registre_IST!$L:$L,Rap_Trim!$B$9,Registre_IST!$O:$O,Rap_Trim!$A15,Registre_IST!$G:$G,Rap_Trim!$J$11,Registre_IST!$I:$I,Rap_Trim!K$12,Registre_IST!$X:$X,Rap_Trim!$G$8),IF(AND($B$9=\"Tous\",$G$8<>\"\"),COUNTIFS(Registre_IST!$Z:$Z,Rap_Trim!$B$8,Registre_IST!$O:$O,Rap_Trim!$A15,Registre_IST!$G:$G,Rap_Trim!$J$11,Registre_IST!$I:$I,Rap_Trim!K$12,Registre_IST!$X:$X,Rap_Trim!$G$8),IF(AND($B$9=\"Tous\",$G$8=\"\"),COUNTIFS(Registre_IST!$Z:$Z,Rap_Trim!$B$8,Registre_IST!$O:$O,Rap_Trim!$A15,Registre_IST!$G:$G,Rap_Trim!$J$11,Registre_IST!$I:$I,Rap_Trim!K$12),IF(AND($B$9<>\"Tous\",$G$8=\"\"),COUNTIFS(Registre_IST!$L:$L,Rap_Trim!$B$9,Registre_IST!$Z:$Z,Rap_Trim!$B$8,Registre_IST!$O:$O,Rap_Trim!$A15,Registre_IST!$G:$G,Rap_Trim!$J$11,Registre_IST!$I:$I,Rap_Trim!K$12)))))","v":0}]
["Ulcère génital",{"$f":"IF(AND($B$9<>\"Tous\",$G$8<>\"\"),COUNTIFS(Registre_IST!$Z:$Z,Rap_Trim!$B$8,Registre_IST!$L:$L,Rap_Trim!$B$9,Registre_IST!$O:$O,Rap_Trim!$A16,Registre_IST!$G:$G,Rap_Trim!$B$11,Registre_IST!$I:$I,Rap_Trim!B$12,Registre_IST!$X:$X,Rap_Trim!$G$8),IF(AND($B$9=\"Tous\",$G$8<>\"\"),COUNTIFS(Registre_IST!$Z:$Z,Rap_Trim!$B$8,Registre_IST!$O:$O,Rap_Trim!$A16,Registre_IST!$G:$G,Rap_Trim!$B$11,Registre_IST!$I:$I,Rap_Trim!B$12,Registre_IST!$X:$X,Rap_Trim!$G$8),IF(AND($B$9=\"Tous\",$G$8=\"\"),COUNTIFS(Registre_IST!$Z:$Z,Rap_Trim!$B$8,Registre_IST!$O:$O,Rap_Trim!$A16,Registre_IST!$G:$G,Rap_Trim!$B$11,Registre_IST!$I:$I,Rap_Trim!B$12),IF(AND($B$9<>\"Tous\",$G$8=\"\"),COUNTIFS(Registre_IST!$L:$L,Rap_Trim!$B$9,Registre_IST!$Z:$Z,Rap_Trim!$B$8,Registre_IST!$O:$O,Rap_Trim!$A16,Registre_IST!$G:$G,Rap_Trim!$B$11,Registre_IST!$I:$I,Rap_Trim!B$12)))))","v":0},{"$f":"IF(AND($B$9<>\"Tous\",$G$8<>\"\"),COUNTIFS(Registre_IST!$Z:$Z,Rap_Trim!$B$8,Registre_IST!$L:$L,Rap_Trim!$B$9,Registre_IST!$O:$O,Rap_Trim!$A16,Registre_IST!$G:$G,Rap_Trim!$B$11,Registre_IST!$I:$I,Rap_Trim!C$12,Registre_IST!$X:$X,Rap_Trim!$G$8),IF(AND($B$9=\"Tous\",$G$8<>\"\"),COUNTIFS(Registre_IST!$Z:$Z,Rap_Trim!$B$8,Registre_IST!$O:$O,Rap_Trim!$A16,Registre_IST!$G:$G,Rap_Trim!$B$11,Registre_IST!$I:$I,Rap_Trim!C$12,Registre_IST!$X:$X,Rap_Trim!$G$8),IF(AND($B$9=\"Tous\",$G$8=\"\"),COUNTIFS(Registre_IST!$Z:$Z,Rap_Trim!$B$8,Registre_IST!$O:$O,Rap_Trim!$A16,Registre_IST!$G:$G,Rap_Trim!$B$11,Registre_IST!$I:$I,Rap_Trim!C$12),IF(AND($B$9<>\"Tous\",$G$8=\"\"),COUNTIFS(Registre_IST!$L:$L,Rap_Trim!$B$9,Registre_IST!$Z:$Z,Rap_Trim!$B$8,Registre_IST!$O:$O,Rap_Trim!$A16,Registre_IST!$G:$G,Rap_Trim!$B$11,Registre_IST!$I:$I,Rap_Trim!C$12)))))","v":0},{"$f":"IF(AND($B$9<>\"Tous\",$G$8<>\"\"),COUNTIFS(Registre_IST!$Z:$Z,Rap_Trim!$B$8,Registre_IST!$L:$L,Rap_Trim!$B$9,Registre_IST!$O:$O,Rap_Trim!$A16,Registre_IST!$G:$G,Rap_Trim!$D$11,Registre_IST!$I:$I,Rap_Trim!D$12,Registre_IST!$X:$X,Rap_Trim!$G$8),IF(AND($B$9=\"Tous\",$G$8<>\"\"),COUNTIFS(Registre_IST!$Z:$Z,Rap_Trim!$B$8,Registre_IST!$O:$O,Rap_Trim!$A16,Registre_IST!$G:$G,Rap_Trim!$D$11,Registre_IST!$I:$I,Rap_Trim!D$12,Registre_IST!$X:$X,Rap_Trim!$G$8),IF(AND($B$9=\"Tous\",$G$8=\"\"),COUNTIFS(Registre_IST!$Z:$Z,Rap_Trim!$B$8,Registre_IST!$O:$O,Rap_Trim!$A16,Registre_IST!$G:$G,Rap_Trim!$D$11,Registre_IST!$I:$I,Rap_Trim!D$12),IF(AND($B$9<>\"Tous\",$G$8=\"\"),COUNTIFS(Registre_IST!$L:$L,Rap_Trim!$B$9,Registre_IST!$Z:$Z,Rap_Trim!$B$8,Registre_IST!$O:$O,Rap_Trim!$A16,Registre_IST!$G:$G,Rap_Trim!$D$11,Registre_IST!$I:$I,Rap_Trim!D$12)))))","v":0},{"$f":"IF(AND($B$9<>\"Tous\",$G$8<>\"\"),COUNTIFS(Registre_IST!$Z:$Z,Rap_Trim!$B$8,Registre_IST!$L:$L,Rap_Trim!$B$9,Registre_IST!$O:$O,Rap_Trim!$A16,Registre_IST!$G:$G,Rap_Trim!$D$11,Registre_IST!$I:$I,Rap_Trim!E$12,Registre_IST!$X:$X,Rap_Trim!$G$8),IF(AND($B$9=\"Tous\",$G$8<>\"\"),COUNTIFS(Registre_IST!$Z:$Z,Rap_Trim!$B$8,Registre_IST!$O:$O,Rap_Trim!$A16,Registre_IST!$G:$G,Rap_Trim!$D$11,Registre_IST!$I:$I,Rap_Trim!E$12,Registre_IST!$X:$X,Rap_Trim!$G$8),IF(AND($B$9=\"Tous\",$G$8=\"\"),COUNTIFS(Registre_IST!$Z:$Z,Rap_Trim!$B$8,Registre_IST!$O:$O,Rap_Trim!$A16,Registre_IST!$G:$G,Rap_Trim!$D$11,Registre_IST!$I:$I,Rap_Trim!E$12),IF(AND($B$9<>\"Tous\",$G$8=\"\"),COUNTIFS(Registre_IST!$L:$L,Rap_Trim!$B$9,Registre_IST!$Z:$Z,Rap_Trim!$B$8,Registre_IST!$O:$O,Rap_Trim!$A16,Registre_IST!$G:$G,Rap_Trim!$D$11,Registre_IST!$I:$I,Rap_Trim!E$12)))))","v":0},{"$f":"IF(AND($B$9<>\"Tous\",$G$8<>\"\"),COUNTIFS(Registre_IST!$Z:$Z,Rap_Trim!$B$8,Registre_IST!$L:$L,Rap_Trim!$B$9,Registre_IST!$O:$O,Rap_Trim!$A16,Registre_IST!$G:$G,Rap_Trim!$F$11,Registre_IST!$I:$I,Rap_Trim!F$12,Registre_IST!$X:$X,Rap_Trim!$G$8),IF(AND($B$9=\"Tous\",$G$8<>\"\"),COUNTIFS(Registre_IST!$Z:$Z,Rap_Trim!$B$8,Registre_IST!$O:$O,Rap_Trim!$A16,Registre_IST!$G:$G,Rap_Trim!$F$11,Registre_IST!$I:$I,Rap_Trim!F$12,Registre_IST!$X:$X,Rap_Trim!$G$8),IF(AND($B$9=\"Tous\",$G$8=\"\"),COUNTIFS(Registre_IST!$Z:$Z,Rap_Trim!$B$8,Registre_IST!$O:$O,Rap_Trim!$A16,Registre_IST!$G:$G,Rap_Trim!$F$11,Registre_IST!$I:$I,Rap_Trim!F$12),IF(AND($B$9<>\"Tous\",$G$8=\"\"),COUNTIFS(Registre_IST!$L:$L,Rap_Trim!$B$9,Registre_IST!$Z:$Z,Rap_Trim!$B$8,Registre_IST!$O:$O,Rap_Trim!$A16,Registre_IST!$G:$G,Rap_Trim!$F$11,Registre_IST!$I:$I,Rap_Trim!F$12)))))","v":0},{"$f":"IF(AND($B$9<>\"Tous\",$G$8<>\"\"),COUNTIFS(Registre_IST!$Z:$Z,Rap_Trim!$B$8,Registre_IST!$L:$L,Rap_Trim!$B$9,Registre_IST!$O:$O,Rap_Trim!$A16,Registre_IST!$G:$G,Rap_Trim!$F$11,Registre_IST!$I:$I,Rap_Trim!G$12,Registre_IST!$X:$X,Rap_Trim!$G$8),IF(AND($B$9=\"Tous\",$G$8<>\"\"),COUNTIFS(Registre_IST!$Z:$Z,Rap_Trim!$B$8,Registre_IST!$O:$O,Rap_Trim!$A16,Registre_IST!$G:$G,Rap_Trim!$F$11,Registre_IST!$I:$I,Rap_Trim!G$12,Registre_IST!$X:$X,Rap_Trim!$G$8),IF(AND($B$9=\"Tous\",$G$8=\"\"),COUNTIFS(Registre_IST!$Z:$Z,Rap_Trim!$B$8,Registre_IST!$O:$O,Rap_Trim!$A16,Registre_IST!$G:$G,Rap_Trim!$F$11,Registre_IST!$I:$I,Rap_Trim!G$12),IF(AND($B$9<>\"Tous\",$G$8=\"\"),COUNTIFS(Registre_IST!$L:$L,Rap_Trim!$B$9,Registre_IST!$Z:$Z,Rap_Trim!$B$8,Registre_IST!$O:$O,Rap_Trim!$A16,Registre_IST!$G:$G,Rap_Trim!$F$11,Registre_IST!$I:$I,Rap_Trim!G$12)))))","v":0},{"$f":"IF(AND($B$9<>\"Tous\",$G$8<>\"\"),COUNTIFS(Registre_IST!$Z:$Z,Rap_Trim!$B$8,Registre_IST!$L:$L,Rap_Trim!$B$9,Registre_IST!$O:$O,Rap_Trim!$A16,Registre_IST!$G:$G,Rap_Trim!$H$11,Registre_IST!$I:$I,Rap_Trim!H$12,Registre_IST!$X:$X,Rap_Trim!$G$8),IF(AND($B$9=\"Tous\",$G$8<>\"\"),COUNTIFS(Registre_IST!$Z:$Z,Rap_Trim!$B$8,Registre_IST!$O:$O,Rap_Trim!$A16,Registre_IST!$G:$G,Rap_Trim!$H$11,Registre_IST!$I:$I,Rap_Trim!H$12,Registre_IST!$X:$X,Rap_Trim!$G$8),IF(AND($B$9=\"Tous\",$G$8=\"\"),COUNTIFS(Registre_IST!$Z:$Z,Rap_Trim!$B$8,Registre_IST!$O:$O,Rap_Trim!$A16,Registre_IST!$G:$G,Rap_Trim!$H$11,Registre_IST!$I:$I,Rap_Trim!H$12),IF(AND($B$9<>\"Tous\",$G$8=\"\"),COUNTIFS(Registre_IST!$L:$L,Rap_Trim!$B$9,Registre_IST!$Z:$Z,Rap_Trim!$B$8,Registre_IST!$O:$O,Rap_Trim!$A16,Registre_IST!$G:$G,Rap_Trim!$H$11,Registre_IST!$I:$I,Rap_Trim!H$12)))))","v":0},{"$f":"IF(AND($B$9<>\"Tous\",$G$8<>\"\"),COUNTIFS(Registre_IST!$Z:$Z,Rap_Trim!$B$8,Registre_IST!$L:$L,Rap_Trim!$B$9,Registre_IST!$O:$O,Rap_Trim!$A16,Registre_IST!$G:$G,Rap_Trim!$H$11,Registre_IST!$I:$I,Rap_Trim!I$12,Registre_IST!$X:$X,Rap_Trim!$G$8),IF(AND($B$9=\"Tous\",$G$8<>\"\"),COUNTIFS(Registre_IST!$Z:$Z,Rap_Trim!$B$8,Registre_IST!$O:$O,Rap_Trim!$A16,Registre_IST!$G:$G,Rap_Trim!$H$11,Registre_IST!$I:$I,Rap_Trim!I$12,Registre_IST!$X:$X,Rap_Trim!$G$8),IF(AND($B$9=\"Tous\",$G$8=\"\"),COUNTIFS(Registre_IST!$Z:$Z,Rap_Trim!$B$8,Registre_IST!$O:$O,Rap_Trim!$A16,Registre_IST!$G:$G,Rap_Trim!$H$11,Registre_IST!$I:$I,Rap_Trim!I$12),IF(AND($B$9<>\"Tous\",$G$8=\"\"),COUNTIFS(Registre_IST!$L:$L,Rap_Trim!$B$9,Registre_IST!$Z:$Z,Rap_Trim!$B$8,Registre_IST!$O:$O,Rap_Trim!$A16,Registre_IST!$G:$G,Rap_Trim!$H$11,Registre_IST!$I:$I,Rap_Trim!I$12)))))","v":0},{"$f":"IF(AND($B$9<>\"Tous\",$G$8<>\"\"),COUNTIFS(Registre_IST!$Z:$Z,Rap_Trim!$B$8,Registre_IST!$L:$L,Rap_Trim!$B$9,Registre_IST!$O:$O,Rap_Trim!$A16,Registre_IST!$G:$G,Rap_Trim!$J$11,Registre_IST!$I:$I,Rap_Trim!J$12,Registre_IST!$X:$X,Rap_Trim!$G$8),IF(AND($B$9=\"Tous\",$G$8<>\"\"),COUNTIFS(Registre_IST!$Z:$Z,Rap_Trim!$B$8,Registre_IST!$O:$O,Rap_Trim!$A16,Registre_IST!$G:$G,Rap_Trim!$J$11,Registre_IST!$I:$I,Rap_Trim!J$12,Registre_IST!$X:$X,Rap_Trim!$G$8),IF(AND($B$9=\"Tous\",$G$8=\"\"),COUNTIFS(Registre_IST!$Z:$Z,Rap_Trim!$B$8,Registre_IST!$O:$O,Rap_Trim!$A16,Registre_IST!$G:$G,Rap_Trim!$J$11,Registre_IST!$I:$I,Rap_Trim!J$12),IF(AND($B$9<>\"Tous\",$G$8=\"\"),COUNTIFS(Registre_IST!$L:$L,Rap_Trim!$B$9,Registre_IST!$Z:$Z,Rap_Trim!$B$8,Registre_IST!$O:$O,Rap_Trim!$A16,Registre_IST!$G:$G,Rap_Trim!$J$11,Registre_IST!$I:$I,Rap_Trim!J$12)))))","v":0},{"$f":"IF(AND($B$9<>\"Tous\",$G$8<>\"\"),COUNTIFS(Registre_IST!$Z:$Z,Rap_Trim!$B$8,Registre_IST!$L:$L,Rap_Trim!$B$9,Registre_IST!$O:$O,Rap_Trim!$A16,Registre_IST!$G:$G,Rap_Trim!$J$11,Registre_IST!$I:$I,Rap_Trim!K$12,Registre_IST!$X:$X,Rap_Trim!$G$8),IF(AND($B$9=\"Tous\",$G$8<>\"\"),COUNTIFS(Registre_IST!$Z:$Z,Rap_Trim!$B$8,Registre_IST!$O:$O,Rap_Trim!$A16,Registre_IST!$G:$G,Rap_Trim!$J$11,Registre_IST!$I:$I,Rap_Trim!K$12,Registre_IST!$X:$X,Rap_Trim!$G$8),IF(AND($B$9=\"Tous\",$G$8=\"\"),COUNTIFS(Registre_IST!$Z:$Z,Rap_Trim!$B$8,Registre_IST!$O:$O,Rap_Trim!$A16,Registre_IST!$G:$G,Rap_Trim!$J$11,Registre_IST!$I:$I,Rap_Trim!K$12),IF(AND($B$9<>\"Tous\",$G$8=\"\"),COUNTIFS(Registre_IST!$L:$L,Rap_Trim!$B$9,Registre_IST!$Z:$Z,Rap_Trim!$B$8,Registre_IST!$O:$O,Rap_Trim!$A16,Registre_IST!$G:$G,Rap_Trim!$J$11,Registre_IST!$I:$I,Rap_Trim!K$12)))))","v":0}]
["Douleurs bas ventre",{"$f":"IF(AND($B$9<>\"Tous\",$G$8<>\"\"),COUNTIFS(Registre_IST!$Z:$Z,Rap_Trim!$B$8,Registre_IST!$L:$L,Rap_Trim!$B$9,Registre_IST!$O:$O,Rap_Trim!$A17,Registre_IST!$G:$G,Rap_Trim!$B$11,Registre_IST!$I:$I,Rap_Trim!B$12,Registre_IST!$X:$X,Rap_Trim!$G$8),IF(AND($B$9=\"Tous\",$G$8<>\"\"),COUNTIFS(Registre_IST!$Z:$Z,Rap_Trim!$B$8,Registre_IST!$O:$O,Rap_Trim!$A17,Registre_IST!$G:$G,Rap_Trim!$B$11,Registre_IST!$I:$I,Rap_Trim!B$12,Registre_IST!$X:$X,Rap_Trim!$G$8),IF(AND($B$9=\"Tous\",$G$8=\"\"),COUNTIFS(Registre_IST!$Z:$Z,Rap_Trim!$B$8,Registre_IST!$O:$O,Rap_Trim!$A17,Registre_IST!$G:$G,Rap_Trim!$B$11,Registre_IST!$I:$I,Rap_Trim!B$12),IF(AND($B$9<>\"Tous\",$G$8=\"\"),COUNTIFS(Registre_IST!$L:$L,Rap_Trim!$B$9,Registre_IST!$Z:$Z,Rap_Trim!$B$8,Registre_IST!$O:$O,Rap_Trim!$A17,Registre_IST!$G:$G,Rap_Trim!$B$11,Registre_IST!$I:$I,Rap_Trim!B$12)))))","v":0},{"$f":"IF(AND($B$9<>\"Tous\",$G$8<>\"\"),COUNTIFS(Registre_IST!$Z:$Z,Rap_Trim!$B$8,Registre_IST!$L:$L,Rap_Trim!$B$9,Registre_IST!$O:$O,Rap_Trim!$A17,Registre_IST!$G:$G,Rap_Trim!$B$11,Registre_IST!$I:$I,Rap_Trim!C$12,Registre_IST!$X:$X,Rap_Trim!$G$8),IF(AND($B$9=\"Tous\",$G$8<>\"\"),COUNTIFS(Registre_IST!$Z:$Z,Rap_Trim!$B$8,Registre_IST!$O:$O,Rap_Trim!$A17,Registre_IST!$G:$G,Rap_Trim!$B$11,Registre_IST!$I:$I,Rap_Trim!C$12,Registre_IST!$X:$X,Rap_Trim!$G$8),IF(AND($B$9=\"Tous\",$G$8=\"\"),COUNTIFS(Registre_IST!$Z:$Z,Rap_Trim!$B$8,Registre_IST!$O:$O,Rap_Trim!$A17,Registre_IST!$G:$G,Rap_Trim!$B$11,Registre_IST!$I:$I,Rap_Trim!C$12),IF(AND($B$9<>\"Tous\",$G$8=\"\"),COUNTIFS(Registre_IST!$L:$L,Rap_Trim!$B$9,Registre_IST!$Z:$Z,Rap_Trim!$B$8,Registre_IST!$O:$O,Rap_Trim!$A17,Registre_IST!$G:$G,Rap_Trim!$B$11,Registre_IST!$I:$I,Rap_Trim!C$12)))))","v":0},{"$f":"IF(AND($B$9<>\"Tous\",$G$8<>\"\"),COUNTIFS(Registre_IST!$Z:$Z,Rap_Trim!$B$8,Registre_IST!$L:$L,Rap_Trim!$B$9,Registre_IST!$O:$O,Rap_Trim!$A17,Registre_IST!$G:$G,Rap_Trim!$D$11,Registre_IST!$I:$I,Rap_Trim!D$12,Registre_IST!$X:$X,Rap_Trim!$G$8),IF(AND($B$9=\"Tous\",$G$8<>\"\"),COUNTIFS(Registre_IST!$Z:$Z,Rap_Trim!$B$8,Registre_IST!$O:$O,Rap_Trim!$A17,Registre_IST!$G:$G,Rap_Trim!$D$11,Registre_IST!$I:$I,Rap_Trim!D$12,Registre_IST!$X:$X,Rap_Trim!$G$8),IF(AND($B$9=\"Tous\",$G$8=\"\"),COUNTIFS(Registre_IST!$Z:$Z,Rap_Trim!$B$8,Registre_IST!$O:$O,Rap_Trim!$A17,Registre_IST!$G:$G,Rap_Trim!$D$11,Registre_IST!$I:$I,Rap_Trim!D$12),IF(AND($B$9<>\"Tous\",$G$8=\"\"),COUNTIFS(Registre_IST!$L:$L,Rap_Trim!$B$9,Registre_IST!$Z:$Z,Rap_Trim!$B$8,Registre_IST!$O:$O,Rap_Trim!$A17,Registre_IST!$G:$G,Rap_Trim!$D$11,Registre_IST!$I:$I,Rap_Trim!D$12)))))","v":0},{"$f":"IF(AND($B$9<>\"Tous\",$G$8<>\"\"),COUNTIFS(Registre_IST!$Z:$Z,Rap_Trim!$B$8,Registre_IST!$L:$L,Rap_Trim!$B$9,Registre_IST!$O:$O,Rap_Trim!$A17,Registre_IST!$G:$G,Rap_Trim!$D$11,Registre_IST!$I:$I,Rap_Trim!E$12,Registre_IST!$X:$X,Rap_Trim!$G$8),IF(AND($B$9=\"Tous\",$G$8<>\"\"),COUNTIFS(Registre_IST!$Z:$Z,Rap_Trim!$B$8,Registre_IST!$O:$O,Rap_Trim!$A17,Registre_IST!$G:$G,Rap_Trim!$D$11,Registre_IST!$I:$I,Rap_Trim!E$12,Registre_IST!$X:$X,Rap_Trim!$G$8),IF(AND($B$9=\"Tous\",$G$8=\"\"),COUNTIFS(Registre_IST!$Z:$Z,Rap_Trim!$B$8,Registre_IST!$O:$O,Rap_Trim!$A17,Registre_IST!$G:$G,Rap_Trim!$D$11,Registre_IST!$I:$I,Rap_Trim!E$12),IF(AND($B$9<>\"Tous\",$G$8=\"\"),COUNTIFS(Registre_IST!$L:$L,Rap_Trim!$B$9,Registre_IST!$Z:$Z,Rap_Trim!$B$8,Registre_IST!$O:$O,Rap_Trim!$A17,Registre_IST!$G:$G,Rap_Trim!$D$11,Registre_IST!$I:$I,Rap_Trim!E$12)))))","v":0},{"$f":"IF(AND($B$9<>\"Tous\",$G$8<>\"\"),COUNTIFS(Registre_IST!$Z:$Z,Rap_Trim!$B$8,Registre_IST!$L:$L,Rap_Trim!$B$9,Registre_IST!$O:$O,Rap_Trim!$A17,Registre_IST!$G:$G,Rap_Trim!$F$11,Registre_IST!$I:$I,Rap_Trim!F$12,Registre_IST!$X:$X,Rap_Trim!$G$8),IF(AND($B$9=\"Tous\",$G$8<>\"\"),COUNTIFS(Registre_IST!$Z:$Z,Rap_Trim!$B$8,Registre_IST!$O:$O,Rap_Trim!$A17,Registre_IST!$G:$G,Rap_Trim!$F$11,Registre_IST!$I:$I,Rap_Trim!F$12,Registre_IST!$X:$X,Rap_Trim!$G$8),IF(AND($B$9=\"Tous\",$G$8=\"\"),COUNTIFS(Registre_IST!$Z:$Z,Rap_Trim!$B$8,Registre_IST!$O:$O,Rap_Trim!$A17,Registre_IST!$G:$G,Rap_Trim!$F$11,Registre_IST!$I:$I,Rap_Trim!F$12),IF(AND($B$9<>\"Tous\",$G$8=\"\"),COUNTIFS(Registre_IST!$L:$L,Rap_Trim!$B$9,Registre_IST!$Z:$Z,Rap_Trim!$B$8,Registre_IST!$O:$O,Rap_Trim!$A17,Registre_IST!$G:$G,Rap_Trim!$F$11,Registre_IST!$I:$I,Rap_Trim!F$12)))))","v":0},{"$f":"IF(AND($B$9<>\"Tous\",$G$8<>\"\"),COUNTIFS(Registre_IST!$Z:$Z,Rap_Trim!$B$8,Registre_IST!$L:$L,Rap_Trim!$B$9,Registre_IST!$O:$O,Rap_Trim!$A17,Registre_IST!$G:$G,Rap_Trim!$F$11,Registre_IST!$I:$I,Rap_Trim!G$12,Registre_IST!$X:$X,Rap_Trim!$G$8),IF(AND($B$9=\"Tous\",$G$8<>\"\"),COUNTIFS(Registre_IST!$Z:$Z,Rap_Trim!$B$8,Registre_IST!$O:$O,Rap_Trim!$A17,Registre_IST!$G:$G,Rap_Trim!$F$11,Registre_IST!$I:$I,Rap_Trim!G$12,Registre_IST!$X:$X,Rap_Trim!$G$8),IF(AND($B$9=\"Tous\",$G$8=\"\"),COUNTIFS(Registre_IST!$Z:$Z,Rap_Trim!$B$8,Registre_IST!$O:$O,Rap_Trim!$A17,Registre_IST!$G:$G,Rap_Trim!$F$11,Registre_IST!$I:$I,Rap_Trim!G$12),IF(AND($B$9<>\"Tous\",$G$8=\"\"),COUNTIFS(Registre_IST!$L:$L,Rap_Trim!$B$9,Registre_IST!$Z:$Z,Rap_Trim!$B$8,Registre_IST!$O:$O,Rap_Trim!$A17,Registre_IST!$G:$G,Rap_Trim!$F$11,Registre_IST!$I:$I,Rap_Trim!G$12)))))","v":0},{"$f":"IF(AND($B$9<>\"Tous\",$G$8<>\"\"),COUNTIFS(Registre_IST!$Z:$Z,Rap_Trim!$B$8,Registre_IST!$L:$L,Rap_Trim!$B$9,Registre_IST!$O:$O,Rap_Trim!$A17,Registre_IST!$G:$G,Rap_Trim!$H$11,Registre_IST!$I:$I,Rap_Trim!H$12,Registre_IST!$X:$X,Rap_Trim!$G$8),IF(AND($B$9=\"Tous\",$G$8<>\"\"),COUNTIFS(Registre_IST!$Z:$Z,Rap_Trim!$B$8,Registre_IST!$O:$O,Rap_Trim!$A17,Registre_IST!$G:$G,Rap_Trim!$H$11,Registre_IST!$I:$I,Rap_Trim!H$12,Registre_IST!$X:$X,Rap_Trim!$G$8),IF(AND($B$9=\"Tous\",$G$8=\"\"),COUNTIFS(Registre_IST!$Z:$Z,Rap_Trim!$B$8,Registre_IST!$O:$O,Rap_Trim!$A17,Registre_IST!$G:$G,Rap_Trim!$H$11,Registre_IST!$I:$I,Rap_Trim!H$12),IF(AND($B$9<>\"Tous\",$G$8=\"\"),COUNTIFS(Registre_IST!$L:$L,Rap_Trim!$B$9,Registre_IST!$Z:$Z,Rap_Trim!$B$8,Registre_IST!$O:$O,Rap_Trim!$A17,Registre_IST!$G:$G,Rap_Trim!$H$11,Registre_IST!$I:$I,Rap_Trim!H$12)))))","v":0},{"$f":"IF(AND($B$9<>\"Tous\",$G$8<>\"\"),COUNTIFS(Registre_IST!$Z:$Z,Rap_Trim!$B$8,Registre_IST!$L:$L,Rap_Trim!$B$9,Registre_IST!$O:$O,Rap_Trim!$A17,Registre_IST!$G:$G,Rap_Trim!$H$11,Registre_IST!$I:$I,Rap_Trim!I$12,Registre_IST!$X:$X,Rap_Trim!$G$8),IF(AND($B$9=\"Tous\",$G$8<>\"\"),COUNTIFS(Registre_IST!$Z:$Z,Rap_Trim!$B$8,Registre_IST!$O:$O,Rap_Trim!$A17,Registre_IST!$G:$G,Rap_Trim!$H$11,Registre_IST!$I:$I,Rap_Trim!I$12,Registre_IST!$X:$X,Rap_Trim!$G$8),IF(AND($B$9=\"Tous\",$G$8=\"\"),COUNTIFS(Registre_IST!$Z:$Z,Rap_Trim!$B$8,Registre_IST!$O:$O,Rap_Trim!$A17,Registre_IST!$G:$G,Rap_Trim!$H$11,Registre_IST!$I:$I,Rap_Trim!I$12),IF(AND($B$9<>\"Tous\",$G$8=\"\"),COUNTIFS(Registre_IST!$L:$L,Rap_Trim!$B$9,Registre_IST!$Z:$Z,Rap_Trim!$B$8,Registre_IST!$O:$O,Rap_Trim!$A17,Registre_IST!$G:$G,Rap_Trim!$H$11,Registre_IST!$I:$I,Rap_Trim!I$12)))))","v":0},{"$f":"IF(AND($B$9<>\"Tous\",$G$8<>\"\"),COUNTIFS(Registre_IST!$Z:$Z,Rap_Trim!$B$8,Registre_IST!$L:$L,Rap_Trim!$B$9,Registre_IST!$O:$O,Rap_Trim!$A17,Registre_IST!$G:$G,Rap_Trim!$J$11,Registre_IST!$I:$I,Rap_Trim!J$12,Registre_IST!$X:$X,Rap_Trim!$G$8),IF(AND($B$9=\"Tous\",$G$8<>\"\"),COUNTIFS(Registre_IST!$Z:$Z,Rap_Trim!$B$8,Registre_IST!$O:$O,Rap_Trim!$A17,Registre_IST!$G:$G,Rap_Trim!$J$11,Registre_IST!$I:$I,Rap_Trim!J$12,Registre_IST!$X:$X,Rap_Trim!$G$8),IF(AND($B$9=\"Tous\",$G$8=\"\"),COUNTIFS(Registre_IST!$Z:$Z,Rap_Trim!$B$8,Registre_IST!$O:$O,Rap_Trim!$A17,Registre_IST!$G:$G,Rap_Trim!$J$11,Registre_IST!$I:$I,Rap_Trim!J$12),IF(AND($B$9<>\"Tous\",$G$8=\"\"),COUNTIFS(Registre_IST!$L:$L,Rap_Trim!$B$9,Registre_IST!$Z:$Z,Rap_Trim!$B$8,Registre_IST!$O:$O,Rap_Trim!$A17,Registre_IST!$G:$G,Rap_Trim!$J$11,Registre_IST!$I:$I,Rap_Trim!J$12)))))","v":0},{"$f":"IF(AND($B$9<>\"Tous\",$G$8<>\"\"),COUNTIFS(Registre_IST!$Z:$Z,Rap_Trim!$B$8,Registre_IST!$L:$L,Rap_Trim!$B$9,Registre_IST!$O:$O,Rap_Trim!$A17,Registre_IST!$G:$G,Rap_Trim!$J$11,Registre_IST!$I:$I,Rap_Trim!K$12,Registre_IST!$X:$X,Rap_Trim!$G$8),IF(AND($B$9=\"Tous\",$G$8<>\"\"),COUNTIFS(Registre_IST!$Z:$Z,Rap_Trim!$B$8,Registre_IST!$O:$O,Rap_Trim!$A17,Registre_IST!$G:$G,Rap_Trim!$J$11,Registre_IST!$I:$I,Rap_Trim!K$12,Registre_IST!$X:$X,Rap_Trim!$G$8),IF(AND($B$9=\"Tous\",$G$8=\"\"),COUNTIFS(Registre_IST!$Z:$Z,Rap_Trim!$B$8,Registre_IST!$O:$O,Rap_Trim!$A17,Registre_IST!$G:$G,Rap_Trim!$J$11,Registre_IST!$I:$I,Rap_Trim!K$12),IF(AND($B$9<>\"Tous\",$G$8=\"\"),COUNTIFS(Registre_IST!$L:$L,Rap_Trim!$B$9,Registre_IST!$Z:$Z,Rap_Trim!$B$8,Registre_IST!$O:$O,Rap_Trim!$A17,Registre_IST!$G:$G,Rap_Trim!$J$11,Registre_IST!$I:$I,Rap_Trim!K$12)))))","v":0}]
["Autres",{"$f":"IF(AND($B$9<>\"Tous\",$G$8<>\"\"),COUNTIFS(Registre_IST!$Z:$Z,Rap_Trim!$B$8,Registre_IST!$L:$L,Rap_Trim!$B$9,Registre_IST!$O:$O,Rap_Trim!$A18,Registre_IST!$G:$G,Rap_Trim!$B$11,Registre_IST!$I:$I,Rap_Trim!B$12,Registre_IST!$X:$X,Rap_Trim!$G$8),IF(AND($B$9=\"Tous\",$G$8<>\"\"),COUNTIFS(Registre_IST!$Z:$Z,Rap_Trim!$B$8,Registre_IST!$O:$O,Rap_Trim!$A18,Registre_IST!$G:$G,Rap_Trim!$B$11,Registre_IST!$I:$I,Rap_Trim!B$12,Registre_IST!$X:$X,Rap_Trim!$G$8),IF(AND($B$9=\"Tous\",$G$8=\"\"),COUNTIFS(Registre_IST!$Z:$Z,Rap_Trim!$B$8,Registre_IST!$O:$O,Rap_Trim!$A18,Registre_IST!$G:$G,Rap_Trim!$B$11,Registre_IST!$I:$I,Rap_Trim!B$12),IF(AND($B$9<>\"Tous\",$G$8=\"\"),COUNTIFS(Registre_IST!$L:$L,Rap_Trim!$B$9,Registre_IST!$Z:$Z,Rap_Trim!$B$8,Registre_IST!$O:$O,Rap_Trim!$A18,Registre_IST!$G:$G,Rap_Trim!$B$11,Registre_IST!$I:$I,Rap_Trim!B$12)))))","v":0},{"$f":"IF(AND($B$9<>\"Tous\",$G$8<>\"\"),COUNTIFS(Registre_IST!$Z:$Z,Rap_Trim!$B$8,Registre_IST!$L:$L,Rap_Trim!$B$9,Registre_IST!$O:$O,Rap_Trim!$A18,Registre_IST!$G:$G,Rap_Trim!$B$11,Registre_IST!$I:$I,Rap_Trim!C$12,Registre_IST!$X:$X,Rap_Trim!$G$8),IF(AND($B$9=\"Tous\",$G$8<>\"\"),COUNTIFS(Registre_IST!$Z:$Z,Rap_Trim!$B$8,Registre_IST!$O:$O,Rap_Trim!$A18,Registre_IST!$G:$G,Rap_Trim!$B$11,Registre_IST!$I:$I,Rap_Trim!C$12,Registre_IST!$X:$X,Rap_Trim!$G$8),IF(AND($B$9=\"Tous\",$G$8=\"\"),COUNTIFS(Registre_IST!$Z:$Z,Rap_Trim!$B$8,Registre_IST!$O:$O,Rap_Trim!$A18,Registre_IST!$G:$G,Rap_Trim!$B$11,Registre_IST!$I:$I,Rap_Trim!C$12),IF(AND($B$9<>\"Tous\",$G$8=\"\"),COUNTIFS(Registre_IST!$L:$L,Rap_Trim!$B$9,Registre_IST!$Z:$Z,Rap_Trim!$B$8,Registre_IST!$O:$O,Rap_Trim!$A18,Registre_IST!$G:$G,Rap_Trim!$B$11,Registre_IST!$I:$I,Rap_Trim!C$12)))))","v":0},{"$f":"IF(AND($B$9<>\"Tous\",$G$8<>\"\"),COUNTIFS(Registre_IST!$Z:$Z,Rap_Trim!$B$8,Registre_IST!$L:$L,Rap_Trim!$B$9,Registre_IST!$O:$O,Rap_Trim!$A18,Registre_IST!$G:$G,Rap_Trim!$D$11,Registre_IST!$I:$I,Rap_Trim!D$12,Registre_IST!$X:$X,Rap_Trim!$G$8),IF(AND($B$9=\"Tous\",$G$8<>\"\"),COUNTIFS(Registre_IST!$Z:$Z,Rap_Trim!$B$8,Registre_IST!$O:$O,Rap_Trim!$A18,Registre_IST!$G:$G,Rap_Trim!$D$11,Registre_IST!$I:$I,Rap_Trim!D$12,Registre_IST!$X:$X,Rap_Trim!$G$8),IF(AND($B$9=\"Tous\",$G$8=\"\"),COUNTIFS(Registre_IST!$Z:$Z,Rap_Trim!$B$8,Registre_IST!$O:$O,Rap_Trim!$A18,Registre_IST!$G:$G,Rap_Trim!$D$11,Registre_IST!$I:$I,Rap_Trim!D$12),IF(AND($B$9<>\"Tous\",$G$8=\"\"),COUNTIFS(Registre_IST!$L:$L,Rap_Trim!$B$9,Registre_IST!$Z:$Z,Rap_Trim!$B$8,Registre_IST!$O:$O,Rap_Trim!$A18,Registre_IST!$G:$G,Rap_Trim!$D$11,Registre_IST!$I:$I,Rap_Trim!D$12)))))","v":0},{"$f":"IF(AND($B$9<>\"Tous\",$G$8<>\"\"),COUNTIFS(Registre_IST!$Z:$Z,Rap_Trim!$B$8,Registre_IST!$L:$L,Rap_Trim!$B$9,Registre_IST!$O:$O,Rap_Trim!$A18,Registre_IST!$G:$G,Rap_Trim!$D$11,Registre_IST!$I:$I,Rap_Trim!E$12,Registre_IST!$X:$X,Rap_Trim!$G$8),IF(AND($B$9=\"Tous\",$G$8<>\"\"),COUNTIFS(Registre_IST!$Z:$Z,Rap_Trim!$B$8,Registre_IST!$O:$O,Rap_Trim!$A18,Registre_IST!$G:$G,Rap_Trim!$D$11,Registre_IST!$I:$I,Rap_Trim!E$12,Registre_IST!$X:$X,Rap_Trim!$G$8),IF(AND($B$9=\"Tous\",$G$8=\"\"),COUNTIFS(Registre_IST!$Z:$Z,Rap_Trim!$B$8,Registre_IST!$O:$O,Rap_Trim!$A18,Registre_IST!$G:$G,Rap_Trim!$D$11,Registre_IST!$I:$I,Rap_Trim!E$12),IF(AND($B$9<>\"Tous\",$G$8=\"\"),COUNTIFS(Registre_IST!$L:$L,Rap_Trim!$B$9,Registre_IST!$Z:$Z,Rap_Trim!$B$8,Registre_IST!$O:$O,Rap_Trim!$A18,Registre_IST!$G:$G,Rap_Trim!$D$11,Registre_IST!$I:$I,Rap_Trim!E$12)))))","v":0},{"$f":"IF(AND($B$9<>\"Tous\",$G$8<>\"\"),COUNTIFS(Registre_IST!$Z:$Z,Rap_Trim!$B$8,Registre_IST!$L:$L,Rap_Trim!$B$9,Registre_IST!$O:$O,Rap_Trim!$A18,Registre_IST!$G:$G,Rap_Trim!$F$11,Registre_IST!$I:$I,Rap_Trim!F$12,Registre_IST!$X:$X,Rap_Trim!$G$8),IF(AND($B$9=\"Tous\",$G$8<>\"\"),COUNTIFS(Registre_IST!$Z:$Z,Rap_Trim!$B$8,Registre_IST!$O:$O,Rap_Trim!$A18,Registre_IST!$G:$G,Rap_Trim!$F$11,Registre_IST!$I:$I,Rap_Trim!F$12,Registre_IST!$X:$X,Rap_Trim!$G$8),IF(AND($B$9=\"Tous\",$G$8=\"\"),COUNTIFS(Registre_IST!$Z:$Z,Rap_Trim!$B$8,Registre_IST!$O:$O,Rap_Trim!$A18,Registre_IST!$G:$G,Rap_Trim!$F$11,Registre_IST!$I:$I,Rap_Trim!F$12),IF(AND($B$9<>\"Tous\",$G$8=\"\"),COUNTIFS(Registre_IST!$L:$L,Rap_Trim!$B$9,Registre_IST!$Z:$Z,Rap_Trim!$B$8,Registre_IST!$O:$O,Rap_Trim!$A18,Registre_IST!$G:$G,Rap_Trim!$F$11,Registre_IST!$I:$I,Rap_Trim!F$12)))))","v":0},{"$f":"IF(AND($B$9<>\"Tous\",$G$8<>\"\"),COUNTIFS(Registre_IST!$Z:$Z,Rap_Trim!$B$8,Registre_IST!$L:$L,Rap_Trim!$B$9,Registre_IST!$O:$O,Rap_Trim!$A18,Registre_IST!$G:$G,Rap_Trim!$F$11,Registre_IST!$I:$I,Rap_Trim!G$12,Registre_IST!$X:$X,Rap_Trim!$G$8),IF(AND($B$9=\"Tous\",$G$8<>\"\"),COUNTIFS(Registre_IST!$Z:$Z,Rap_Trim!$B$8,Registre_IST!$O:$O,Rap_Trim!$A18,Registre_IST!$G:$G,Rap_Trim!$F$11,Registre_IST!$I:$I,Rap_Trim!G$12,Registre_IST!$X:$X,Rap_Trim!$G$8),IF(AND($B$9=\"Tous\",$G$8=\"\"),COUNTIFS(Registre_IST!$Z:$Z,Rap_Trim!$B$8,Registre_IST!$O:$O,Rap_Trim!$A18,Registre_IST!$G:$G,Rap_Trim!$F$11,Registre_IST!$I:$I,Rap_Trim!G$12),IF(AND($B$9<>\"Tous\",$G$8=\"\"),COUNTIFS(Registre_IST!$L:$L,Rap_Trim!$B$9,Registre_IST!$Z:$Z,Rap_Trim!$B$8,Registre_IST!$O:$O,Rap_Trim!$A18,Registre_IST!$G:$G,Rap_Trim!$F$11,Registre_IST!$I:$I,Rap_Trim!G$12)))))","v":0},{"$f":"IF(AND($B$9<>\"Tous\",$G$8<>\"\"),COUNTIFS(Registre_IST!$Z:$Z,Rap_Trim!$B$8,Registre_IST!$L:$L,Rap_Trim!$B$9,Registre_IST!$O:$O,Rap_Trim!$A18,Registre_IST!$G:$G,Rap_Trim!$H$11,Registre_IST!$I:$I,Rap_Trim!H$12,Registre_IST!$X:$X,Rap_Trim!$G$8),IF(AND($B$9=\"Tous\",$G$8<>\"\"),COUNTIFS(Registre_IST!$Z:$Z,Rap_Trim!$B$8,Registre_IST!$O:$O,Rap_Trim!$A18,Registre_IST!$G:$G,Rap_Trim!$H$11,Registre_IST!$I:$I,Rap_Trim!H$12,Registre_IST!$X:$X,Rap_Trim!$G$8),IF(AND($B$9=\"Tous\",$G$8=\"\"),COUNTIFS(Registre_IST!$Z:$Z,Rap_Trim!$B$8,Registre_IST!$O:$O,Rap_Trim!$A18,Registre_IST!$G:$G,Rap_Trim!$H$11,Registre_IST!$I:$I,Rap_Trim!H$12),IF(AND($B$9<>\"Tous\",$G$8=\"\"),COUNTIFS(Registre_IST!$L:$L,Rap_Trim!$B$9,Registre_IST!$Z:$Z,Rap_Trim!$B$8,Registre_IST!$O:$O,Rap_Trim!$A18,Registre_IST!$G:$G,Rap_Trim!$H$11,Registre_IST!$I:$I,Rap_Trim!H$12)))))","v":0},{"$f":"IF(AND($B$9<>\"Tous\",$G$8<>\"\"),COUNTIFS(Registre_IST!$Z:$Z,Rap_Trim!$B$8,Registre_IST!$L:$L,Rap_Trim!$B$9,Registre_IST!$O:$O,Rap_Trim!$A18,Registre_IST!$G:$G,Rap_Trim!$H$11,Registre_IST!$I:$I,Rap_Trim!I$12,Registre_IST!$X:$X,Rap_Trim!$G$8),IF(AND($B$9=\"Tous\",$G$8<>\"\"),COUNTIFS(Registre_IST!$Z:$Z,Rap_Trim!$B$8,Registre_IST!$O:$O,Rap_Trim!$A18,Registre_IST!$G:$G,Rap_Trim!$H$11,Registre_IST!$I:$I,Rap_Trim!I$12,Registre_IST!$X:$X,Rap_Trim!$G$8),IF(AND($B$9=\"Tous\",$G$8=\"\"),COUNTIFS(Registre_IST!$Z:$Z,Rap_Trim!$B$8,Registre_IST!$O:$O,Rap_Trim!$A18,Registre_IST!$G:$G,Rap_Trim!$H$11,Registre_IST!$I:$I,Rap_Trim!I$12),IF(AND($B$9<>\"Tous\",$G$8=\"\"),COUNTIFS(Registre_IST!$L:$L,Rap_Trim!$B$9,Registre_IST!$Z:$Z,Rap_Trim!$B$8,Registre_IST!$O:$O,Rap_Trim!$A18,Registre_IST!$G:$G,Rap_Trim!$H$11,Registre_IST!$I:$I,Rap_Trim!I$12)))))","v":0},{"$f":"IF(AND($B$9<>\"Tous\",$G$8<>\"\"),COUNTIFS(Registre_IST!$Z:$Z,Rap_Trim!$B$8,Registre_IST!$L:$L,Rap_Trim!$B$9,Registre_IST!$O:$O,Rap_Trim!$A18,Registre_IST!$G:$G,Rap_Trim!$J$11,Registre_IST!$I:$I,Rap_Trim!J$12,Registre_IST!$X:$X,Rap_Trim!$G$8),IF(AND($B$9=\"Tous\",$G$8<>\"\"),COUNTIFS(Registre_IST!$Z:$Z,Rap_Trim!$B$8,Registre_IST!$O:$O,Rap_Trim!$A18,Registre_IST!$G:$G,Rap_Trim!$J$11,Registre_IST!$I:$I,Rap_Trim!J$12,Registre_IST!$X:$X,Rap_Trim!$G$8),IF(AND($B$9=\"Tous\",$G$8=\"\"),COUNTIFS(Registre_IST!$Z:$Z,Rap_Trim!$B$8,Registre_IST!$O:$O,Rap_Trim!$A18,Registre_IST!$G:$G,Rap_Trim!$J$11,Registre_IST!$I:$I,Rap_Trim!J$12),IF(AND($B$9<>\"Tous\",$G$8=\"\"),COUNTIFS(Registre_IST!$L:$L,Rap_Trim!$B$9,Registre_IST!$Z:$Z,Rap_Trim!$B$8,Registre_IST!$O:$O,Rap_Trim!$A18,Registre_IST!$G:$G,Rap_Trim!$J$11,Registre_IST!$I:$I,Rap_Trim!J$12)))))","v":0},{"$f":"IF(AND($B$9<>\"Tous\",$G$8<>\"\"),COUNTIFS(Registre_IST!$Z:$Z,Rap_Trim!$B$8,Registre_IST!$L:$L,Rap_Trim!$B$9,Registre_IST!$O:$O,Rap_Trim!$A18,Registre_IST!$G:$G,Rap_Trim!$J$11,Registre_IST!$I:$I,Rap_Trim!K$12,Registre_IST!$X:$X,Rap_Trim!$G$8),IF(AND($B$9=\"Tous\",$G$8<>\"\"),COUNTIFS(Registre_IST!$Z:$Z,Rap_Trim!$B$8,Registre_IST!$O:$O,Rap_Trim!$A18,Registre_IST!$G:$G,Rap_Trim!$J$11,Registre_IST!$I:$I,Rap_Trim!K$12,Registre_IST!$X:$X,Rap_Trim!$G$8),IF(AND($B$9=\"Tous\",$G$8=\"\"),COUNTIFS(Registre_IST!$Z:$Z,Rap_Trim!$B$8,Registre_IST!$O:$O,Rap_Trim!$A18,Registre_IST!$G:$G,Rap_Trim!$J$11,Registre_IST!$I:$I,Rap_Trim!K$12),IF(AND($B$9<>\"Tous\",$G$8=\"\"),COUNTIFS(Registre_IST!$L:$L,Rap_Trim!$B$9,Registre_IST!$Z:$Z,Rap_Trim!$B$8,Registre_IST!$O:$O,Rap_Trim!$A18,Registre_IST!$G:$G,Rap_Trim!$J$11,Registre_IST!$I:$I,Rap_Trim!K$12)))))","v":0}]
["Total",{"$f":"SUM(B13:B18)","v":0},{"$f":"SUM(C13:C18)","v":0},0,0,0,0,0,0,0,0]
[]
[]
[]
[null,null,null,null,null,null,null,"Signé par :"]
[]
[]
[]
[null,null,null,null,null,null,null,"Qualité :"]

{"sheet":"Méd_cons","index":9,"n_rows":21,"n_cols":18,"rows_kept":21,"cut":false,"hidden":true,"merged":[[1,2,1,3],[2,2,2,3],[3,2,3,3]]}
["Association de Lutte Contre le Sida"]
["Section",null,{"$f":"IF(Accueil!$D$9<>\"\",Accueil!$D$9,\"\")","v":""}]
["Année",null,{"$f":"IF(Accueil!$D$10<>\"\",Accueil!$D$10,\"\")","v":""}]
["CIDAG",null,{"$f":"IF(Accueil!$D$11<>\"\",Accueil!$D$11,\"\")","v":""}]
[]
["Consultation IST"]
[]
[]
["Consommation en médicaments"]
[]
[]
[]
[null,"Janvier","Février","Mars","Trimestre 1","Avril","Mai","Juin","Trimestre 2","Juillet","Août","Septembre","Trimestre 3","Octobre","Novembre","Décembre","Trimestre 4","Total"]
["Benz Péni 1,2",{"$f":"SUMIFS(Registre_IST!$U:$U,Registre_IST!$T:$T,Méd_cons!$A14,Registre_IST!$C:$C,Méd_cons!B$13)","v":0},{"$f":"SUMIFS(Registre_IST!$U:$U,Registre_IST!$T:$T,Méd_cons!$A14,Registre_IST!$C:$C,Méd_cons!C$13)","v":0},{"$f":"SUMIFS(Registre_IST!$U:$U,Registre_IST!$T:$T,Méd_cons!$A14,Registre_IST!$C:$C,Méd_cons!D$13)","v":0},{"$f":"SUM($B14:$D14)","v":0},{"$f":"SUMIFS(Registre_IST!$U:$U,Registre_IST!$T:$T,Méd_cons!$A14,Registre_IST!$C:$C,Méd_cons!F$13)","v":0},{"$f":"SUMIFS(Registre_IST!$U:$U,Registre_IST!$T:$T,Méd_cons!$A14,Registre_IST!$C:$C,Méd_cons!G$13)","v":0},{"$f":"SUMIFS(Registre_IST!$U:$U,Registre_IST!$T:$T,Méd_cons!$A14,Registre_IST!$C:$C,Méd_cons!H$13)","v":0},{"$f":"SUM($F14:$H14)","v":0},{"$f":"SUMIFS(Registre_IST!$U:$U,Registre_IST!$T:$T,Méd_cons!$A14,Registre_IST!$C:$C,Méd_cons!J$13)","v":0},{"$f":"SUMIFS(Registre_IST!$U:$U,Registre_IST!$T:$T,Méd_cons!$A14,Registre_IST!$C:$C,Méd_cons!K$13)","v":0},{"$f":"SUMIFS(Registre_IST!$U:$U,Registre_IST!$T:$T,Méd_cons!$A14,Registre_IST!$C:$C,Méd_cons!L$13)","v":0},{"$f":"SUM($J14:$L14)","v":0},{"$f":"SUMIFS(Registre_IST!$U:$U,Registre_IST!$T:$T,Méd_cons!$A14,Registre_IST!$C:$C,Méd_cons!N$13)","v":0},{"$f":"SUMIFS(Registre_IST!$U:$U,Registre_IST!$T:$T,Méd_cons!$A14,Registre_IST!$C:$C,Méd_cons!O$13)","v":0},{"$f":"SUMIFS(Registre_IST!$U:$U,Registre_IST!$T:$T,Méd_cons!$A14,Registre_IST!$C:$C,Méd_cons!P$13)","v":0},{"$f":"SUM($N14:$P14)","v":0},{"$f":"E14+I14+M14+Q14","v":0}]
["Ceftriaxone",{"$f":"SUMIFS(Registre_IST!$U:$U,Registre_IST!$T:$T,Méd_cons!$A15,Registre_IST!$C:$C,Méd_cons!B$13)","v":0},{"$f":"SUMIFS(Registre_IST!$U:$U,Registre_IST!$T:$T,Méd_cons!$A15,Registre_IST!$C:$C,Méd_cons!C$13)","v":0},{"$f":"SUMIFS(Registre_IST!$U:$U,Registre_IST!$T:$T,Méd_cons!$A15,Registre_IST!$C:$C,Méd_cons!D$13)","v":0},{"$f":"SUM($B15:$D15)","v":0},{"$f":"SUMIFS(Registre_IST!$U:$U,Registre_IST!$T:$T,Méd_cons!$A15,Registre_IST!$C:$C,Méd_cons!F$13)","v":0},{"$f":"SUMIFS(Registre_IST!$U:$U,Registre_IST!$T:$T,Méd_cons!$A15,Registre_IST!$C:$C,Méd_cons!G$13)","v":0},{"$f":"SUMIFS(Registre_IST!$U:$U,Registre_IST!$T:$T,Méd_cons!$A15,Registre_IST!$C:$C,Méd_cons!H$13)","v":0},{"$f":"SUM($F15:$H15)","v":0},{"$f":"SUMIFS(Registre_IST!$U:$U,Registre_IST!$T:$T,Méd_cons!$A15,Registre_IST!$C:$C,Méd_cons!J$13)","v":0},{"$f":"SUMIFS(Registre_IST!$U:$U,Registre_IST!$T:$T,Méd_cons!$A15,Registre_IST!$C:$C,Méd_cons!K$13)","v":0},{"$f":"SUMIFS(Registre_IST!$U:$U,Registre_IST!$T:$T,Méd_cons!$A15,Registre_IST!$C:$C,Méd_cons!L$13)","v":0},{"$f":"SUM($J15:$L15)","v":0},{"$f":"SUMIFS(Registre_IST!$U:$U,Registre_IST!$T:$T,Méd_cons!$A15,Registre_IST!$C:$C,Méd_cons!N$13)","v":0},{"$f":"SUMIFS(Registre_IST!$U:$U,Registre_IST!$T:$T,Méd_cons!$A15,Registre_IST!$C:$C,Méd_cons!O$13)","v":0},{"$f":"SUMIFS(Registre_IST!$U:$U,Registre_IST!$T:$T,Méd_cons!$A15,Registre_IST!$C:$C,Méd_cons!P$13)","v":0},{"$f":"SUM($N15:$P15)","v":0},{"$f":"E15+I15+M15+Q15","v":0}]
["Erythromycine",{"$f":"SUMIFS(Registre_IST!$U:$U,Registre_IST!$T:$T,Méd_cons!$A16,Registre_IST!$C:$C,Méd_cons!B$13)","v":0},{"$f":"SUMIFS(Registre_IST!$U:$U,Registre_IST!$T:$T,Méd_cons!$A16,Registre_IST!$C:$C,Méd_cons!C$13)","v":0},{"$f":"SUMIFS(Registre_IST!$U:$U,Registre_IST!$T:$T,Méd_cons!$A16,Registre_IST!$C:$C,Méd_cons!D$13)","v":0},0,{"$f":"SUMIFS(Registre_IST!$U:$U,Registre_IST!$T:$T,Méd_cons!$A16,Registre_IST!$C:$C,Méd_cons!F$13)","v":0},{"$f":"SUMIFS(Registre_IST!$U:$U,Registre_IST!$T:$T,Méd_cons!$A16,Registre_IST!$C:$C,Méd_cons!G$13)","v":0},{"$f":"SUMIFS(Registre_IST!$U:$U,Registre_IST!$T:$T,Méd_cons!$A16,Registre_IST!$C:$C,Méd_cons!H$13)","v":0},0,{"$f":"SUMIFS(Registre_IST!$U:$U,Registre_IST!$T:$T,Méd_cons!$A16,Registre_IST!$C:$C,Méd_cons!J$13)","v":0},{"$f":"SUMIFS(Registre_IST!$U:$U,Registre_IST!$T:$T,Méd_cons!$A16,Registre_IST!$C:$C,Méd_cons!K$13)","v":0},{"$f":"SUMIFS(Registre_IST!$U:$U,Registre_IST!$T:$T,Méd_cons!$A16,Registre_IST!$C:$C,Méd_cons!L$13)","v":0},0,{"$f":"SUMIFS(Registre_IST!$U:$U,Registre_IST!$T:$T,Méd_cons!$A16,Registre_IST!$C:$C,Méd_cons!N$13)","v":0},{"$f":"SUMIFS(Registre_IST!$U:$U,Registre_IST!$T:$T,Méd_cons!$A16,Registre_IST!$C:$C,Méd_cons!O$13)","v":0},{"$f":"SUMIFS(Registre_IST!$U:$U,Registre_IST!$T:$T,Méd_cons!$A16,Registre_IST!$C:$C,Méd_cons!P$13)","v":0},0,0]
["Doxicycline",{"$f":"SUMIFS(Registre_IST!$U:$U,Registre_IST!$T:$T,Méd_cons!$A17,Registre_IST!$C:$C,Méd_cons!B$13)","v":0},{"$f":"SUMIFS(Registre_IST!$U:$U,Registre_IST!$T:$T,Méd_cons!$A17,Registre_IST!$C:$C,Méd_cons!C$13)","v":0},{"$f":"SUMIFS(Registre_IST!$U:$U,Registre_IST!$T:$T,Méd_cons!$A17,Registre_IST!$C:$C,Méd_cons!D$13)","v":0},0,{"$f":"SUMIFS(Registre_IST!$U:$U,Registre_IST!$T:$T,Méd_cons!$A17,Registre_IST!$C:$C,Méd_cons!F$13)","v":0},{"$f":"SUMIFS(Registre_IST!$U:$U,Registre_IST!$T:$T,Méd_cons!$A17,Registre_IST!$C:$C,Méd_cons!G$13)","v":0},{"$f":"SUMIFS(Registre_IST!$U:$U,Registre_IST!$T:$T,Méd_cons!$A17,Registre_IST!$C:$C,Méd_cons!H$13)","v":0},0,{"$f":"SUMIFS(Registre_IST!$U:$U,Registre_IST!$T:$T,Méd_cons!$A17,Registre_IST!$C:$C,Méd_cons!J$13)","v":0},{"$f":"SUMIFS(Registre_IST!$U:$U,Registre_IST!$T:$T,Méd_cons!$A17,Registre_IST!$C:$C,Méd_cons!K$13)","v":0},{"$f":"SUMIFS(Registre_IST!$U:$U,Registre_IST!$T:$T,Méd_cons!$A17,Registre_IST!$C:$C,Méd_cons!L$13)","v":0},0,{"$f":"SUMIFS(Registre_IST!$U:$U,Registre_IST!$T:$T,Méd_cons!$A17,Registre_IST!$C:$C,Méd_cons!N$13)","v":0},{"$f":"SUMIFS(Registre_IST!$U:$U,Registre_IST!$T:$T,Méd_cons!$A17,Registre_IST!$C:$C,Méd_cons!O$13)","v":0},{"$f":"SUMIFS(Registre_IST!$U:$U,Registre_IST!$T:$T,Méd_cons!$A17,Registre_IST!$C:$C,Méd_cons!P$13)","v":0},0,0]
["Econazol",{"$f":"SUMIFS(Registre_IST!$U:$U,Registre_IST!$T:$T,Méd_cons!$A18,Registre_IST!$C:$C,Méd_cons!B$13)","v":0},{"$f":"SUMIFS(Registre_IST!$U:$U,Registre_IST!$T:$T,Méd_cons!$A18,Registre_IST!$C:$C,Méd_cons!C$13)","v":0},{"$f":"SUMIFS(Registre_IST!$U:$U,Registre_IST!$T:$T,Méd_cons!$A18,Registre_IST!$C:$C,Méd_cons!D$13)","v":0},0,{"$f":"SUMIFS(Registre_IST!$U:$U,Registre_IST!$T:$T,Méd_cons!$A18,Registre_IST!$C:$C,Méd_cons!F$13)","v":0},{"$f":"SUMIFS(Registre_IST!$U:$U,Registre_IST!$T:$T,Méd_cons!$A18,Registre_IST!$C:$C,Méd_cons!G$13)","v":0},{"$f":"SUMIFS(Registre_IST!$U:$U,Registre_IST!$T:$T,Méd_cons!$A18,Registre_IST!$C:$C,Méd_cons!H$13)","v":0},0,{"$f":"SUMIFS(Registre_IST!$U:$U,Registre_IST!$T:$T,Méd_cons!$A18,Registre_IST!$C:$C,Méd_cons!J$13)","v":0},{"$f":"SUMIFS(Registre_IST!$U:$U,Registre_IST!$T:$T,Méd_cons!$A18,Registre_IST!$C:$C,Méd_cons!K$13)","v":0},{"$f":"SUMIFS(Registre_IST!$U:$U,Registre_IST!$T:$T,Méd_cons!$A18,Registre_IST!$C:$C,Méd_cons!L$13)","v":0},0,{"$f":"SUMIFS(Registre_IST!$U:$U,Registre_IST!$T:$T,Méd_cons!$A18,Registre_IST!$C:$C,Méd_cons!N$13)","v":0},{"$f":"SUMIFS(Registre_IST!$U:$U,Registre_IST!$T:$T,Méd_cons!$A18,Registre_IST!$C:$C,Méd_cons!O$13)","v":0},{"$f":"SUMIFS(Registre_IST!$U:$U,Registre_IST!$T:$T,Méd_cons!$A18,Registre_IST!$C:$C,Méd_cons!P$13)","v":0},0,0]
["Métronidazol",{"$f":"SUMIFS(Registre_IST!$U:$U,Registre_IST!$T:$T,Méd_cons!$A19,Registre_IST!$C:$C,Méd_cons!B$13)","v":0},{"$f":"SUMIFS(Registre_IST!$U:$U,Registre_IST!$T:$T,Méd_cons!$A19,Registre_IST!$C:$C,Méd_cons!C$13)","v":0},{"$f":"SUMIFS(Registre_IST!$U:$U,Registre_IST!$T:$T,Méd_cons!$A19,Registre_IST!$C:$C,Méd_cons!D$13)","v":0},0,{"$f":"SUMIFS(Registre_IST!$U:$U,Registre_IST!$T:$T,Méd_cons!$A19,Registre_IST!$C:$C,Méd_cons!F$13)","v":0},{"$f":"SUMIFS(Registre_IST!$U:$U,Registre_IST!$T:$T,Méd_cons!$A19,Registre_IST!$C:$C,Méd_cons!G$13)","v":0},{"$f":"SUMIFS(Registre_IST!$U:$U,Registre_IST!$T:$T,Méd_cons!$A19,Registre_IST!$C:$C,Méd_cons!H$13)","v":0},0,{"$f":"SUMIFS(Registre_IST!$U:$U,Registre_IST!$T:$T,Méd_cons!$A19,Registre_IST!$C:$C,Méd_cons!J$13)","v":0},{"$f":"SUMIFS(Registre_IST!$U:$U,Registre_IST!$T:$T,Méd_cons!$A19,Registre_IST!$C:$C,Méd_cons!K$13)","v":0},{"$f":"SUMIFS(Registre_IST!$U:$U,Registre_IST!$T:$T,Méd_cons!$A19,Registre_IST!$C:$C,Méd_cons!L$13)","v":0},0,{"$f":"SUMIFS(Registre_IST!$U:$U,Registre_IST!$T:$T,Méd_cons!$A19,Registre_IST!$C:$C,Méd_cons!N$13)","v":0},{"$f":"SUMIFS(Registre_IST!$U:$U,Registre_IST!$T:$T,Méd_cons!$A19,Registre_IST!$C:$C,Méd_cons!O$13)","v":0},{"$f":"SUMIFS(Registre_IST!$U:$U,Registre_IST!$T:$T,Méd_cons!$A19,Registre_IST!$C:$C,Méd_cons!P$13)","v":0},0,0]
["Ciprofloxacine",{"$f":"SUMIFS(Registre_IST!$U:$U,Registre_IST!$T:$T,Méd_cons!$A20,Registre_IST!$C:$C,Méd_cons!B$13)","v":0},{"$f":"SUMIFS(Registre_IST!$U:$U,Registre_IST!$T:$T,Méd_cons!$A20,Registre_IST!$C:$C,Méd_cons!C$13)","v":0},{"$f":"SUMIFS(Registre_IST!$U:$U,Registre_IST!$T:$T,Méd_cons!$A20,Registre_IST!$C:$C,Méd_cons!D$13)","v":0},0,{"$f":"SUMIFS(Registre_IST!$U:$U,Registre_IST!$T:$T,Méd_cons!$A20,Registre_IST!$C:$C,Méd_cons!F$13)","v":0},{"$f":"SUMIFS(Registre_IST!$U:$U,Registre_IST!$T:$T,Méd_cons!$A20,Registre_IST!$C:$C,Méd_cons!G$13)","v":0},{"$f":"SUMIFS(Registre_IST!$U:$U,Registre_IST!$T:$T,Méd_cons!$A20,Registre_IST!$C:$C,Méd_cons!H$13)","v":0},0,{"$f":"SUMIFS(Registre_IST!$U:$U,Registre_IST!$T:$T,Méd_cons!$A20,Registre_IST!$C:$C,Méd_cons!J$13)","v":0},{"$f":"SUMIFS(Registre_IST!$U:$U,Registre_IST!$T:$T,Méd_cons!$A20,Registre_IST!$C:$C,Méd_cons!K$13)","v":0},{"$f":"SUMIFS(Registre_IST!$U:$U,Registre_IST!$T:$T,Méd_cons!$A20,Registre_IST!$C:$C,Méd_cons!L$13)","v":0},0,{"$f":"SUMIFS(Registre_IST!$U:$U,Registre_IST!$T:$T,Méd_cons!$A20,Registre_IST!$C:$C,Méd_cons!N$13)","v":0},{"$f":"SUMIFS(Registre_IST!$U:$U,Registre_IST!$T:$T,Méd_cons!$A20,Registre_IST!$C:$C,Méd_cons!O$13)","v":0},{"$f":"SUMIFS(Registre_IST!$U:$U,Registre_IST!$T:$T,Méd_cons!$A20,Registre_IST!$C:$C,Méd_cons!P$13)","v":0},0,0]
["Total",{"$f":"SUM(B$14:B$20)","v":0},{"$f":"SUM(C$14:C$20)","v":0},0,0,0,0,0,0,0,0,0,0,0,0,0,0,0]

{"sheet":"Gestion_Stock","index":10,"n_rows":1500,"n_cols":18,"rows_kept":1500,"cut":false,"hidden":true,"merged":[]}
[]
["Association de Lutte Contre le Sida"]
["Section",{"$f":"IF(Accueil!$D$9<>\"\",Accueil!$D$9,\"\")","v":""}]
["CIDAG",{"$f":"IF(Accueil!$D$11<>\"\",Accueil!$D$11,\"\")","v":""},null,"Gestion des médicaments IST"]
["Année",{"$f":"IF(Accueil!$D$10<>\"\",Accueil!$D$10,\"\")","v":""}]
[]
["Date","Désignation","Num_Lot","Date_per","Entrées","Sorties","Approvisionné par","Destination_Sortie","Observation",null,null,null,null,"Mois","Stock","Test","Trimestre","Semestre"]
[null,null,null,null,null,null,null,null,{"$f":"IF(AND(A8<>\"\",YEAR(A8)<>$B$5),\"Erreur date\",\"\")","v":""},null,null,null,null,{"$f":"IF(A8<>\"\",INDEX(Mois_date,MONTH(A8),1),\"\")","v":""},{"$f":"IF(OR(E8<>\"\",F8<>\"\"),E8-F8,\"\")","v":""},{"$f":"IF(AND(D8<>\"\",D8<=TODAY()),\"Perimé\",IF(AND(D8<>\"\",D8<=TODAY()+30),\"Moins d'un mois\",IF(AND(D8<>\"\",D8<=TODAY()+90),\"Moins 3 mois\",IF(AND(D8<>\"\",D8>TODAY()+90),\"Plus 3 mois\",\"\"))))","v":""},{"$f":"IF(OR(N8=\"Janvier\",N8=\"Février\",N8=\"Mars\"),\"Trimestre 1\",IF(OR(N8=\"Avril\",N8=\"Mai\",N8=\"Juin\"),\"Trimestre 2\",IF(OR(N8=\"Juillet\",N8=\"Août\",N8=\"Septembre\"),\"Trimestre 3\",IF(OR(N8=\"Octobre\",N8=\"Novembre\",N8=\"Décembre\"),\"Trimestre 4\",\"\"))))","v":""},{"$f":"IF(OR(Q8=\"Trimestre 1\",Q8=\"Trimestre 2\"),\"Semestre 1\",IF(OR(Q8=\"Trimestre 3\",Q8=\"Trimestre 4\"),\"Semestre 2\",\"\"))","v":""}]
[null,null,null,null,null,null,null,null,{"$f":"IF(AND(A9<>\"\",YEAR(A9)<>$B$5),\"Erreur date\",\"\")","v":""},null,null,null,null,"",{"$f":"IF(OR(E9<>\"\",F9<>\"\"),E9-F9,\"\")","v":""},{"$f":"IF(AND(D9<>\"\",D9<=TODAY()),\"Perimé\",IF(AND(D9<>\"\",D9<=TODAY()+30),\"Moins d'un mois\",IF(AND(D9<>\"\",D9<=TODAY()+90),\"Moins 3 mois\",IF(AND(D9<>\"\",D9>TODAY()+90),\"Plus 3 mois\",\"\"))))","v":""},{"$f":"IF(OR(N9=\"Janvier\",N9=\"Février\",N9=\"Mars\"),\"Trimestre 1\",IF(OR(N9=\"Avril\",N9=\"Mai\",N9=\"Juin\"),\"Trimestre 2\",IF(OR(N9=\"Juillet\",N9=\"Août\",N9=\"Septembre\"),\"Trimestre 3\",IF(OR(N9=\"Octobre\",N9=\"Novembre\",N9=\"Décembre\"),\"Trimestre 4\",\"\"))))","v":""},{"$f":"IF(OR(Q9=\"Trimestre 1\",Q9=\"Trimestre 2\"),\"Semestre 1\",IF(OR(Q9=\"Trimestre 3\",Q9=\"Trimestre 4\"),\"Semestre 2\",\"\"))","v":""}]
[null,null,null,null,null,null,null,null,"",null,null,null,null,"","","","",""]
[null,null,null,null,null,null,null,null,"",null,null,null,null,"","","","",""]
[null,null,null,null,null,null,null,null,"",null,null,null,null,"","","","",""]
[null,null,null,null,null,null,null,null,"",null,null,null,null,"","","","",""]
[null,null,null,null,null,null,null,null,"",null,null,null,null,"","","","",""]
[null,null,null,null,null,null,null,null,"",null,null,null,null,"","","","",""]
[null,null,null,null,null,null,null,null,"",null,null,null,null,"","","","",""]
[null,null,null,null,null,null,null,null,"",null,null,null,null,"","","","",""]
[null,null,null,null,null,null,null,null,"",null,null,null,null,"","","","",""]
[null,null,null,null,null,null,null,null,"",null,null,null,null,"","","","",""]
[null,null,null,null,null,null,null,null,"",null,null,null,null,"","","","",""]
[null,null,null,null,null,null,null,null,"",null,null,null,null,"","","","",""]
[null,null,null,null,null,null,null,null,"",null,null,null,null,"","","","",""]
[null,null,null,null,null,null,null,null,"",null,null,null,null,"","","","",""]
[null,null,null,null,null,null,null,null,"",null,null,null,null,"","","","",""]
[null,null,null,null,null,null,null,null,"",null,null,null,null,"","","","",""]
[null,null,null,null,null,null,null,null,"",null,null,null,null,"","","","",""]
[null,null,null,null,null,null,null,null,"",null,null,null,null,"","","","",""]
[null,null,null,null,null,null,null,null,"",null,null,null,null,"","","","",""]
[null,null,null,null,null,null,null,null,"",null,null,null,null,"","","","",""]
[null,null,null,null,null,null,null,null,"",null,null,null,null,"","","","",""]
[null,null,null,null,null,null,null,null,"",null,null,null,null,"","","","",""]
[null,null,null,null,null,null,null,null,"",null,null,null,null,"","","","",""]
[null,null,null,null,null,null,null,null,"",null,null,null,null,"","","","",""]
[null,null,null,null,null,null,null,null,"",null,null,null,null,"","","","",""]
[null,null,null,null,null,null,null,null,"",null,null,null,null,"","","","",""]
[null,null,null,null,null,null,null,null,"",null,null,null,null,"","","","",""]
[null,null,null,null,null,null,null,null,"",null,null,null,null,"","","","",""]
[null,null,null,null,null,null,null,null,"",null,null,null,null,"","","","",""]
[null,null,null,null,null,null,null,null,"",null,null,null,null,"","","","",""]
[null,null,null,null,null,null,null,null,"",null,null,null,null,"","","","",""]
[null,null,null,null,null,null,null,null,"",null,null,null,null,"","","","",""]
[null,null,null,null,null,null,null,null,"",null,null,null,null,"","","","",""]
[null,null,null,null,null,null,null,null,"",null,null,null,null,"","","","",""]
[null,null,null,null,null,null,null,null,"",null,null,null,null,"","","","",""]
[null,null,null,null,null,null,null,null,"",null,null,null,null,"","","","",""]
[null,null,null,null,null,null,null,null,"",null,null,null,null,"","","","",""]
[null,null,null,null,null,null,null,null,"",null,null,null,null,"","","","",""]
[null,null,null,null,null,null,null,null,"",null,null,null,null,"","","","",""]
[null,null,null,null,null,null,null,null,"",null,null,null,null,"","","","",""]
[null,null,null,null,null,null,null,null,"",null,null,null,null,"","","","",""]
[null,null,null,null,null,null,null,null,"",null,null,null,null,"","","","",""]
[null,null,null,null,null,null,null,null,"",null,null,null,null,"","","","",""]
[null,null,null,null,null,null,null,null,"",null,null,null,null,"","","","",""]
[null,null,null,null,null,null,null,null,"",null,null,null,null,"","","","",""]
[null,null,null,null,null,null,null,null,"",null,null,null,null,"","","","",""]
[null,null,null,null,null,null,null,null,"",null,null,null,null,"","","","",""]
[null,null,null,null,null,null,null,null,"",null,null,null,null,"","","","",""]
[null,null,null,null,null,null,null,null,"",null,null,null,null,"","","","",""]
[null,null,null,null,null,null,null,null,"",null,null,null,null,"","","","",""]
[null,null,null,null,null,null,null,null,"",null,null,null,null,"","","","",""]
[null,null,null,null,null,null,null,null,"",null,null,null,null,"","","","",""]
[null,null,null,null,null,null,null,null,"",null,null,null,null,"","","","",""]
[null,null,null,null,null,null,null,null,"",null,null,null,null,"","","","",""]
[null,null,null,null,null,null,null,null,"",null,null,null,null,"","","","",""]
[null,null,null,null,null,null,null,null,"",null,null,null,null,"","","","",""]
[null,null,null,null,null,null,null,null,"",null,null,null,null,"","","","",""]
[null,null,null,null,null,null,null,null,"",null,null,null,null,"","","","",""]
[null,null,null,null,null,null,null,null,"",null,null,null,null,"","","","",""]
[null,null,null,null,null,null,null,null,"",null,null,null,null,"","","","",""]
[null,null,null,null,null,null,null,null,"",null,null,null,null,"","","","",""]
[null,null,null,null,null,null,null,null,"",null,null,null,null,"","","","",""]
[null,null,null,null,null,null,null,null,"",null,null,null,null,{"$f":"IF(A72<>\"\",INDEX(Mois_date,MONTH(A72),1),\"\")","v":""},"","","",""]
[null,null,null,null,null,null,null,null,{"$f":"IF(AND(A73<>\"\",YEAR(A73)<>$B$5),\"Erreur date\",\"\")","v":""},null,null,null,null,"",{"$f":"IF(OR(E73<>\"\",F73<>\"\"),E73-F73,\"\")","v":""},{"$f":"IF(AND(D73<>\"\",D73<=TODAY()),\"Perimé\",IF(AND(D73<>\"\",D73<=TODAY()+30),\"Moins d'un mois\",IF(AND(D73<>\"\",D73<=TODAY()+90),\"Moins 3 mois\",IF(AND(D73<>\"\",D73>TODAY()+90),\"Plus 3 mois\",\"\"))))","v":""},{"$f":"IF(OR(N73=\"Janvier\",N73=\"Février\",N73=\"Mars\"),\"Trimestre 1\",IF(OR(N73=\"Avril\",N73=\"Mai\",N73=\"Juin\"),\"Trimestre 2\",IF(OR(N73=\"Juillet\",N73=\"Août\",N73=\"Septembre\"),\"Trimestre 3\",IF(OR(N73=\"Octobre\",N73=\"Novembre\",N73=\"Décembre\"),\"Trimestre 4\",\"\"))))","v":""},{"$f":"IF(OR(Q73=\"Trimestre 1\",Q73=\"Trimestre 2\"),\"Semestre 1\",IF(OR(Q73=\"Trimestre 3\",Q73=\"Trimestre 4\"),\"Semestre 2\",\"\"))","v":""}]
[null,null,null,null,null,null,null,null,"",null,null,null,null,"","","","",""]
[null,null,null,null,null,null,null,null,"",null,null,null,null,"","","","",""]
[null,null,null,null,null,null,null,null,"",null,null,null,null,"","","","",""]
[null,null,null,null,null,null,null,null,"",null,null,null,null,"","","","",""]
[null,null,null,null,null,null,null,null,"",null,null,null,null,"","","","",""]
[null,null,null,null,null,null,null,null,"",null,null,null,null,"","","","",""]
[null,null,null,null,null,null,null,null,"",null,null,null,null,"","","","",""]
[null,null,null,null,null,null,null,null,"",null,null,null,null,"","","","",""]
[null,null,null,null,null,null,null,null,"",null,null,null,null,"","","","",""]
[null,null,null,null,null,null,null,null,"",null,null,null,null,"","","","",""]
[null,null,null,null,null,null,null,null,"",null,null,null,null,"","","","",""]
[null,null,null,null,null,null,null,null,"",null,null,null,null,"","","","",""]
[null,null,null,null,null,null,null,null,"",null,null,null,null,"","","","",""]
[null,null,null,null,null,null,null,null,"",null,null,null,null,"","","","",""]
[null,null,null,null,null,null,null,null,"",null,null,null,null,"","","","",""]
[null,null,null,null,null,null,null,null,"",null,null,null,null,"","","","",""]
[null,null,null,null,null,null,null,null,"",null,null,null,null,"","","","",""]
[null,null,null,null,null,null,null,null,"",null,null,null,null,"","","","",""]
[null,null,null,null,null,null,null,null,"",null,null,null,null,"","","","",""]
[null,null,null,null,null,null,null,null,"",null,null,null,null,"","","","",""]
[null,null,null,null,null,null,null,null,"",null,null,null,null,"","","","",""]
[null,null,null,null,null,null,null,null,"",null,null,null,null,"","","","",""]
[null,null,null,null,null,null,null,null,"",null,null,null,null,"","","","",""]
[null,null,null,null,null,null,null,null,"",null,null,null,null,"","","","",""]
[null,null,null,null,null,null,null,null,"",null,null,null,null,"","","","",""]
[null,null,null,null,null,null,null,null,"",null,null,null,null,"","","","",""]
[null,null,null,null,null,null,null,null,"",null,null,null,null,"","","","",""]
[null,null,null,null,null,null,null,null,"",null,null,null,null,"","","","",""]
[null,null,null,null,null,null,null,null,"",null,null,null,null,"","","","",""]
[null,null,null,null,null,null,null,null,"",null,null,null,null,"","","","",""]
[null,null,null,null,null,null,null,null,"",null,null,null,null,"","","","",""]
[null,null,null,null,null,null,null,null,"",null,null,null,null,"","","","",""]
[null,null,null,null,null,null,null,null,"",null,null,null,null,"","","","",""]
[null,null,null,null,null,null,null,null,"",null,null,null,null,"","","","",""]
[null,null,null,null,null,null,null,null,"",null,null,null,null,"","","","",""]
[null,null,null,null,null,null,null,null,"",null,null,null,null,"","","","",""]
[null,null,null,null,null,null,null,null,"",null,null,null,null,"","","","",""]
[null,null,null,null,null,null,null,null,"",null,null,null,null,"","","","",""]
[null,null,null,null,null,null,null,null,"",null,null,null,null,"","","","",""]
[null,null,null,null,null,null,null,null,"",null,null,null,null,"","","","",""]
[null,null,null,null,null,null,null,null,"",null,null,null,null,"","","","",""]
[null,null,null,null,null,null,null,null,"",null,null,null,null,"","","","",""]
[null,null,null,null,null,null,null,null,"",null,null,null,null,"","","","",""]
[null,null,null,null,null,null,null,null,"",null,null,null,null,"","","","",""]
[null,null,null,null,null,null,null,null,"",null,null,null,null,"","","","",""]
[null,null,null,null,null,null,null,null,"",null,null,null,null,"","","","",""]
[null,null,null,null,null,null,null,null,"",null,null,null,null,"","","","",""]
[null,null,null,null,null,null,null,null,"",null,null,null,null,"","","","",""]
[null,null,null,null,null,null,null,null,"",null,null,null,null,"","","","",""]
[null,null,null,null,null,null,null,null,"",null,null,null,null,"","","","",""]
[null,null,null,null,null,null,null,null,"",null,null,null,null,"","","","",""]
[null,null,null,null,null,null,null,null,"",null,null,null,null,"","","","",""]
[null,null,null,null,null,null,null,null,"",null,null,null,null,"","","","",""]
[null,null,null,null,null,null,null,null,"",null,null,null,null,"","","","",""]
[null,null,null,null,null,null,null,null,"",null,null,null,null,"","","","",""]
[null,null,null,null,null,null,null,null,"",null,null,null,null,"","","","",""]
[null,null,null,null,null,null,null,null,"",null,null,null,null,"","","","",""]
[null,null,null,null,null,null,null,null,"",null,null,null,null,"","","","",""]
[null,null,null,null,null,null,null,null,"",null,null,null,null,"","","","",""]
[null,null,null,null,null,null,null,null,"",null,null,null,null,"","","","",""]
[null,null,null,null,null,null,null,null,"",null,null,null,null,"","","","",""]
[null,null,null,null,null,null,null,null,"",null,null,null,null,"","","","",""]
[null,null,null,null,null,null,null,null,"",null,null,null,null,{"$f":"IF(A136<>\"\",INDEX(Mois_date,MONTH(A136),1),\"\")","v":""},"","","",""]
[null,null,null,null,null,null,null,null,{"$f":"IF(AND(A137<>\"\",YEAR(A137)<>$B$5),\"Erreur date\",\"\")","v":""},null,null,null,null,"",{"$f":"IF(OR(E137<>\"\",F137<>\"\"),E137-F137,\"\")","v":""},{"$f":"IF(AND(D137<>\"\",D137<=TODAY()),\"Perimé\",IF(AND(D137<>\"\",D137<=TODAY()+30),\"Moins d'un mois\",IF(AND(D137<>\"\",D137<=TODAY()+90),\"Moins 3 mois\",IF(AND(D137<>\"\",D137>TODAY()+90),\"Plus 3 mois\",\"\"))))","v":""},{"$f":"IF(OR(N137=\"Janvier\",N137=\"Février\",N137=\"Mars\"),\"Trimestre 1\",IF(OR(N137=\"Avril\",N137=\"Mai\",N137=\"Juin\"),\"Trimestre 2\",IF(OR(N137=\"Juillet\",N137=\"Août\",N137=\"Septembre\"),\"Trimestre 3\",IF(OR(N137=\"Octobre\",N137=\"Novembre\",N137=\"Décembre\"),\"Trimestre 4\",\"\"))))","v":""},{"$f":"IF(OR(Q137=\"Trimestre 1\",Q137=\"Trimestre 2\"),\"Semestre 1\",IF(OR(Q137=\"Trimestre 3\",Q137=\"Trimestre 4\"),\"Semestre 2\",\"\"))","v":""}]
[null,null,null,null,null,null,null,null,"",null,null,null,null,"","","","",""]
[null,null,null,null,null,null,null,null,"",null,null,null,null,"","","","",""]
[null,null,null,null,null,null,null,null,"",null,null,null,null,"","","","",""]
[null,null,null,null,null,null,null,null,"",null,null,null,null,"","","","",""]
[null,null,null,null,null,null,null,null,"",null,null,null,null,"","","","",""]
[null,null,null,null,null,null,null,null,"",null,null,null,null,"","","","",""]
[null,null,null,null,null,null,null,null,"",null,null,null,null,"","","","",""]
[null,null,null,null,null,null,null,null,"",null,null,null,null,"","","","",""]
[null,null,null,null,null,null,null,null,"",null,null,null,null,"","","","",""]
[null,null,null,null,null,null,null,null,"",null,null,null,null,"","","","",""]
[null,null,null,null,null,null,null,null,"",null,null,null,null,"","","","",""]
[null,null,null,null,null,null,null,null,"",null,null,null,null,"","","","",""]
[null,null,null,null,null,null,null,null,"",null,null,null,null,"","","","",""]
[null,null,null,null,null,null,null,null,"",null,null,null,null,"","","","",""]
[null,null,null,null,null,null,null,null,"",null,null,null,null,"","","","",""]
[null,null,null,null,null,null,null,null,"",null,null,null,null,"","","","",""]
[null,null,null,null,null,null,null,null,"",null,null,null,null,"","","","",""]
[null,null,null,null,null,null,null,null,"",null,null,null,null,"","","","",""]
[null,null,null,null,null,null,null,null,"",null,null,null,null,"","","","",""]
[null,null,null,null,null,null,null,null,"",null,null,null,null,"","","","",""]
[null,null,null,null,null,null,null,null,"",null,null,null,null,"","","","",""]
[null,null,null,null,null,null,null,null,"",null,null,null,null,"","","","",""]
[null,null,null,null,null,null,null,null,"",null,null,null,null,"","","","",""]
[null,null,null,null,null,null,null,null,"",null,null,null,null,"","","","",""]
[null,null,null,null,null,null,null,null,"",null,null,null,null,"","","","",""]
[null,null,null,null,null,null,null,null,"",null,null,null,null,"","","","",""]
[null,null,null,null,null,null,null,null,"",null,null,null,null,"","","","",""]
[null,null,null,null,null,null,null,null,"",null,null,null,null,"","","","",""]
[null,null,null,null,null,null,null,null,"",null,null,null,null,"","","","",""]
[null,null,null,null,null,null,null,null,"",null,null,null,null,"","","","",""]
[null,null,null,null,null,null,null,null,"",null,null,null,null,"","","","",""]
[null,null,null,null,null,null,null,null,"",null,null,null,null,"","","","",""]
[null,null,null,null,null,null,null,null,"",null,null,null,null,"","","","",""]
[null,null,null,null,null,null,null,null,"",null,null,null,null,"","","","",""]
[null,null,null,null,null,null,null,null,"",null,null,null,null,"","","","",""]
[null,null,null,null,null,null,null,null,"",null,null,null,null,"","","","",""]
[null,null,null,null,null,null,null,null,"",null,null,null,null,"","","","",""]
[null,null,null,null,null,null,null,null,"",null,null,null,null,"","","","",""]
[null,null,null,null,null,null,null,null,"",null,null,null,null,"","","","",""]
[null,null,null,null,null,null,null,null,"",null,null,null,null,"","","","",""]
[null,null,null,null,null,null,null,null,"",null,null,null,null,"","","","",""]
[null,null,null,null,null,null,null,null,"",null,null,null,null,"","","","",""]
[null,null,null,null,null,null,null,null,"",null,null,null,null,"","","","",""]
[null,null,null,null,null,null,null,null,"",null,null,null,null,"","","","",""]
[null,null,null,null,null,null,null,null,"",null,null,null,null,"","","","",""]
[null,null,null,null,null,null,null,null,"",null,null,null,null,"","","","",""]
[null,null,null,null,null,null,null,null,"",null,null,null,null,"","","","",""]
[null,null,null,null,null,null,null,null,"",null,null,null,null,"","","","",""]
[null,null,null,null,null,null,null,null,"",null,null,null,null,"","","","",""]
[null,null,null,null,null,null,null,null,"",null,null,null,null,"","","","",""]
[null,null,null,null,null,null,null,null,"",null,null,null,null,"","","","",""]
[null,null,null,null,null,null,null,null,"",null,null,null,null,"","","","",""]
[null,null,null,null,null,null,null,null,"",null,null,null,null,"","","","",""]
[null,null,null,null,null,null,null,null,"",null,null,null,null,"","","","",""]
[null,null,null,null,null,null,null,null,"",null,null,null,null,"","","","",""]
[null,null,null,null,null,null,null,null,"",null,null,null,null,"","","","",""]
[null,null,null,null,null,null,null,null,"",null,null,null,null,"","","","",""]
[null,null,null,null,null,null,null,null,"",null,null,null,null,"","","","",""]
[null,null,null,null,null,null,null,null,"",null,null,null,null,"","","","",""]
[null,null,null,null,null,null,null,null,"",null,null,null,null,"","","","",""]
[null,null,null,null,null,null,null,null,"",null,null,null,null,"","","","",""]
[null,null,null,null,null,null,null,null,"",null,null,null,null,"","","","",""]
[null,null,null,null,null,null,null,null,"",null,null,null,null,{"$f":"IF(A200<>\"\",INDEX(Mois_date,MONTH(A200),1),\"\")","v":""},"","","",""]
[null,null,null,null,null,null,null,null,{"$f":"IF(AND(A201<>\"\",YEAR(A201)<>$B$5),\"Erreur date\",\"\")","v":""},null,null,null,null,"",{"$f":"IF(OR(E201<>\"\",F201<>\"\"),E201-F201,\"\")","v":""},{"$f":"IF(AND(D201<>\"\",D201<=TODAY()),\"Perimé\",IF(AND(D201<>\"\",D201<=TODAY()+30),\"Moins d'un mois\",IF(AND(D201<>\"\",D201<=TODAY()+90),\"Moins 3 mois\",IF(AND(D201<>\"\",D201>TODAY()+90),\"Plus 3 mois\",\"\"))))","v":""},{"$f":"IF(OR(N201=\"Janvier\",N201=\"Février\",N201=\"Mars\"),\"Trimestre 1\",IF(OR(N201=\"Avril\",N201=\"Mai\",N201=\"Juin\"),\"Trimestre 2\",IF(OR(N201=\"Juillet\",N201=\"Août\",N201=\"Septembre\"),\"Trimestre 3\",IF(OR(N201=\"Octobre\",N201=\"Novembre\",N201=\"Décembre\"),\"Trimestre 4\",\"\"))))","v":""},{"$f":"IF(OR(Q201=\"Trimestre 1\",Q201=\"Trimestre 2\"),\"Semestre 1\",IF(OR(Q201=\"Trimestre 3\",Q201=\"Trimestre 4\"),\"Semestre 2\",\"\"))","v":""}]
[null,null,null,null,null,null,null,null,"",null,null,null,null,"","","","",""]
[null,null,null,null,null,null,null,null,"",null,null,null,null,"","","","",""]
[null,null,null,null,null,null,null,null,"",null,null,null,null,"","","","",""]
[null,null,null,null,null,null,null,null,"",null,null,null,null,"","","","",""]
[null,null,null,null,null,null,null,null,"",null,null,null,null,"","","","",""]
[null,null,null,null,null,null,null,null,"",null,null,null,null,"","","","",""]
[null,null,null,null,null,null,null,null,"",null,null,null,null,"","","","",""]
[null,null,null,null,null,null,null,null,"",null,null,null,null,"","","","",""]
[null,null,null,null,null,null,null,null,"",null,null,null,null,"","","","",""]
[null,null,null,null,null,null,null,null,"",null,null,null,null,"","","","",""]
[null,null,null,null,null,null,null,null,"",null,null,null,null,"","","","",""]
[null,null,null,null,null,null,null,null,"",null,null,null,null,"","","","",""]
[null,null,null,null,null,null,null,null,"",null,null,null,null,"","","","",""]
[null,null,null,null,null,null,null,null,"",null,null,null,null,"","","","",""]
[null,null,null,null,null,null,null,null,"",null,null,null,null,"","","","",""]
[null,null,null,null,null,null,null,null,"",null,null,null,null,"","","","",""]
[null,null,null,null,null,null,null,null,"",null,null,null,null,"","","","",""]
[null,null,null,null,null,null,null,null,"",null,null,null,null,"","","","",""]
[null,null,null,null,null,null,null,null,"",null,null,null,null,"","","","",""]
[null,null,null,null,null,null,null,null,"",null,null,null,null,"","","","",""]
[null,null,null,null,null,null,null,null,"",null,null,null,null,"","","","",""]
[null,null,null,null,null,null,null,null,"",null,null,null,null,"","","","",""]
[null,null,null,null,null,null,null,null,"",null,null,null,null,"","","","",""]
[null,null,null,null,null,null,null,null,"",null,null,null,null,"","","","",""]
[null,null,null,null,null,null,null,null,"",null,null,null,null,"","","","",""]
[null,null,null,null,null,null,null,null,"",null,null,null,null,"","","","",""]
[null,null,null,null,null,null,null,null,"",null,null,null,null,"","","","",""]
[null,null,null,null,null,null,null,null,"",null,null,null,null,"","","","",""]
[null,null,null,null,null,null,null,null,"",null,null,null,null,"","","","",""]
[null,null,null,null,null,null,null,null,"",null,null,null,null,"","","","",""]
[null,null,null,null,null,null,null,null,"",null,null,null,null,"","","","",""]
[null,null,null,null,null,null,null,null,"",null,null,null,null,"","","","",""]
[null,null,null,null,null,null,null,null,"",null,null,null,null,"","","","",""]
[null,null,null,null,null,null,null,null,"",null,null,null,null,"","","","",""]
[null,null,null,null,null,null,null,null,"",null,null,null,null,"","","","",""]
[null,null,null,null,null,null,null,null,"",null,null,null,null,"","","","",""]
[null,null,null,null,null,null,null,null,"",null,null,null,null,"","","","",""]
[null,null,null,null,null,null,null,null,"",null,null,null,null,"","","","",""]
[null,null,null,null,null,null,null,null,"",null,null,null,null,"","","","",""]
[null,null,null,null,null,null,null,null,"",null,null,null,null,"","","","",""]
[null,null,null,null,null,null,null,null,"",null,null,null,null,"","","","",""]
[null,null,null,null,null,null,null,null,"",null,null,null,null,"","","","",""]
[null,null,null,null,null,null,null,null,"",null,null,null,null,"","","","",""]
[null,null,null,null,null,null,null,null,"",null,null,null,null,"","","","",""]
[null,null,null,null,null,null,null,null,"",null,null,null,null,"","","","",""]
[null,null,null,null,null,null,null,null,"",null,null,null,null,"","","","",""]
[null,null,null,null,null,null,null,null,"",null,null,null,null,"","","","",""]
[null,null,null,null,null,null,null,null,"",null,null,null,null,"","","","",""]
[null,null,null,null,null,null,null,null,"",null,null,null,null,"","","","",""]
[null,null,null,null,null,null,null,null,"",null,null,null,null,"","","","",""]
[null,null,null,null,null,null,null,null,"",null,null,null,null,"","","","",""]
[null,null,null,null,null,null,null,null,"",null,null,null,null,"","","","",""]
[null,null,null,null,null,null,null,null,"",null,null,null,null,"","","","",""]
[null,null,null,null,null,null,null,null,"",null,null,null,null,"","","","",""]
[null,null,null,null,null,null,null,null,"",null,null,null,null,"","","","",""]
[null,null,null,null,null,null,null,null,"",null,null,null,null,"","","","",""]
[null,null,null,null,null,null,null,null,"",null,null,null,null,"","","","",""]
[null,null,null,null,null,null,null,null,"",null,null,null,null,"","","","",""]
[null,null,null,null,null,null,null,null,"",null,null,null,null,"","","","",""]
[null,null,null,null,null,null,null,null,"",null,null,null,null,"","","","",""]
[null,null,null,null,null,null,null,null,"",null,null,null,null,"","","","",""]
[null,null,null,null,null,null,null,null,"",null,null,null,null,"","","","",""]
[null,null,null,null,null,null,null,null,"",null,null,null,null,{"$f":"IF(A264<>\"\",INDEX(Mois_date,MONTH(A264),1),\"\")","v":""},"","","",""]
[null,null,null,null,null,null,null,null,{"$f":"IF(AND(A265<>\"\",YEAR(A265)<>$B$5),\"Erreur date\",\"\")","v":""},null,null,null,null,"",{"$f":"IF(OR(E265<>\"\",F265<>\"\"),E265-F265,\"\")","v":""},{"$f":"IF(AND(D265<>\"\",D265<=TODAY()),\"Perimé\",IF(AND(D265<>\"\",D265<=TODAY()+30),\"Moins d'un mois\",IF(AND(D265<>\"\",D265<=TODAY()+90),\"Moins 3 mois\",IF(AND(D265<>\"\",D265>TODAY()+90),\"Plus 3 mois\",\"\"))))","v":""},{"$f":"IF(OR(N265=\"Janvier\",N265=\"Février\",N265=\"Mars\"),\"Trimestre 1\",IF(OR(N265=\"Avril\",N265=\"Mai\",N265=\"Juin\"),\"Trimestre 2\",IF(OR(N265=\"Juillet\",N265=\"Août\",N265=\"Septembre\"),\"Trimestre 3\",IF(OR(N265=\"Octobre\",N265=\"Novembre\",N265=\"Décembre\"),\"Trimestre 4\",\"\"))))","v":""},{"$f":"IF(OR(Q265=\"Trimestre 1\",Q265=\"Trimestre 2\"),\"Semestre 1\",IF(OR(Q265=\"Trimestre 3\",Q265=\"Trimestre 4\"),\"Semestre 2\",\"\"))","v":""}]
[null,null,null,null,null,null,null,null,"",null,null,null,null,"","","","",""]
[null,null,null,null,null,null,null,null,"",null,null,null,null,"","","","",""]
[null,null,null,null,null,null,null,null,"",null,null,null,null,"","","","",""]
[null,null,null,null,null,null,null,null,"",null,null,null,null,"","","","",""]
[null,null,null,null,null,null,null,null,"",null,null,null,null,"","","","",""]
[null,null,null,null,null,null,null,null,"",null,null,null,null,"","","","",""]
[null,null,null,null,null,null,null,null,"",null,null,null,null,"","","","",""]
[null,null,null,null,null,null,null,null,"",null,null,null,null,"","","","",""]
[null,null,null,null,null,null,null,null,"",null,null,null,null,"","","","",""]
[null,null,null,null,null,null,null,null,"",null,null,null,null,"","","","",""]
[null,null,null,null,null,null,null,null,"",null,null,null,null,"","","","",""]
[null,null,null,null,null,null,null,null,"",null,null,null,null,"","","","",""]
[null,null,null,null,null,null,null,null,"",null,null,null,null,"","","","",""]
[null,null,null,null,null,null,null,null,"",null,null,null,null,"","","","",""]
[null,null,null,null,null,null,null,null,"",null,null,null,null,"","","","",""]
[null,null,null,null,null,null,null,null,"",null,null,null,null,"","","","",""]
[null,null,null,null,null,null,null,null,"",null,null,null,null,"","","","",""]
[null,null,null,null,null,null,null,null,"",null,null,null,null,"","","","",""]
[null,null,null,null,null,null,null,null,"",null,null,null,null,"","","","",""]
[null,null,null,null,null,null,null,null,"",null,null,null,null,"","","","",""]
[null,null,null,null,null,null,null,null,"",null,null,null,null,"","","","",""]
[null,null,null,null,null,null,null,null,"",null,null,null,null,"","","","",""]
[null,null,null,null,null,null,null,null,"",null,null,null,null,"","","","",""]
[null,null,null,null,null,null,null,null,"",null,null,null,null,"","","","",""]
[null,null,null,null,null,null,null,null,"",null,null,null,null,"","","","",""]
[null,null,null,null,null,null,null,null,"",null,null,null,null,"","","","",""]
[null,null,null,null,null,null,null,null,"",null,null,null,null,"","","","",""]
[null,null,null,null,null,null,null,null,"",null,null,null,null,"","","","",""]
[null,null,null,null,null,null,null,null,"",null,null,null,null,"","","","",""]
[null,null,null,null,null,null,null,null,"",null,null,null,null,"","","","",""]
[null,null,null,null,null,null,null,null,"",null,null,null,null,"","","","",""]
[null,null,null,null,null,null,null,null,"",null,null,null,null,"","","","",""]
[null,null,null,null,null,null,null,null,"",null,null,null,null,"","","","",""]
[null,null,null,null,null,null,null,null,"",null,null,null,null,"","","","",""]
[null,null,null,null,null,null,null,null,"",null,null,null,null,"","","","",""]
[null,null,null,null,null,null,null,null,"",null,null,null,null,"","","","",""]
[null,null,null,null,null,null,null,null,"",null,null,null,null,"","","","",""]
[null,null,null,null,null,null,null,null,"",null,null,null,null,"","","","",""]
[null,null,null,null,null,null,null,null,"",null,null,null,null,"","","","",""]
[null,null,null,null,null,null,null,null,"",null,null,null,null,"","","","",""]
[null,null,null,null,null,null,null,null,"",null,null,null,null,"","","","",""]
[null,null,null,null,null,null,null,null,"",null,null,null,null,"","","","",""]
[null,null,null,null,null,null,null,null,"",null,null,null,null,"","","","",""]
[null,null,null,null,null,null,null,null,"",null,null,null,null,"","","","",""]
[null,null,null,null,null,null,null,null,"",null,null,null,null,"","","","",""]
[null,null,null,null,null,null,null,null,"",null,null,null,null,"","","","",""]
[null,null,null,null,null,null,null,null,"",null,null,null,null,"","","","",""]
[null,null,null,null,null,null,null,null,"",null,null,null,null,"","","","",""]
[null,null,null,null,null,null,null,null,"",null,null,null,null,"","","","",""]
[null,null,null,null,null,null,null,null,"",null,null,null,null,"","","","",""]
[null,null,null,null,null,null,null,null,"",null,null,null,null,"","","","",""]
[null,null,null,null,null,null,null,null,"",null,null,null,null,"","","","",""]
[null,null,null,null,null,null,null,null,"",null,null,null,null,"","","","",""]
[null,null,null,null,null,null,null,null,"",null,null,null,null,"","","","",""]
[null,null,null,null,null,null,null,null,"",null,null,null,null,"","","","",""]
[null,null,null,null,null,null,null,null,"",null,null,null,null,"","","","",""]
[null,null,null,null,null,null,null,null,"",null,null,null,null,"","","","",""]
[null,null,null,null,null,null,null,null,"",null,null,null,null,"","","","",""]
[null,null,null,null,null,null,null,null,"",null,null,null,null,"","","","",""]
[null,null,null,null,null,null,null,null,"",null,null,null,null,"","","","",""]
[null,null,null,null,null,null,null,null,"",null,null,null,null,"","","","",""]
[null,null,null,null,null,null,null,null,"",null,null,null,null,"","","","",""]
[null,null,null,null,null,null,null,null,"",null,null,null,null,{"$f":"IF(A328<>\"\",INDEX(Mois_date,MONTH(A328),1),\"\")","v":""},"","","",""]
[null,null,null,null,null,null,null,null,{"$f":"IF(AND(A329<>\"\",YEAR(A329)<>$B$5),\"Erreur date\",\"\")","v":""},null,null,null,null,"",{"$f":"IF(OR(E329<>\"\",F329<>\"\"),E329-F329,\"\")","v":""},{"$f":"IF(AND(D329<>\"\",D329<=TODAY()),\"Perimé\",IF(AND(D329<>\"\",D329<=TODAY()+30),\"Moins d'un mois\",IF(AND(D329<>\"\",D329<=TODAY()+90),\"Moins 3 mois\",IF(AND(D329<>\"\",D329>TODAY()+90),\"Plus 3 mois\",\"\"))))","v":""},{"$f":"IF(OR(N329=\"Janvier\",N329=\"Février\",N329=\"Mars\"),\"Trimestre 1\",IF(OR(N329=\"Avril\",N329=\"Mai\",N329=\"Juin\"),\"Trimestre 2\",IF(OR(N329=\"Juillet\",N329=\"Août\",N329=\"Septembre\"),\"Trimestre 3\",IF(OR(N329=\"Octobre\",N329=\"Novembre\",N329=\"Décembre\"),\"Trimestre 4\",\"\"))))","v":""},{"$f":"IF(OR(Q329=\"Trimestre 1\",Q329=\"Trimestre 2\"),\"Semestre 1\",IF(OR(Q329=\"Trimestre 3\",Q329=\"Trimestre 4\"),\"Semestre 2\",\"\"))","v":""}]
[null,null,null,null,null,null,null,null,"",null,null,null,null,"","","","",""]
[null,null,null,null,null,null,null,null,"",null,null,null,null,"","","","",""]
[null,null,null,null,null,null,null,null,"",null,null,null,null,"","","","",""]
[null,null,null,null,null,null,null,null,"",null,null,null,null,"","","","",""]
[null,null,null,null,null,null,null,null,"",null,null,null,null,"","","","",""]
[null,null,null,null,null,null,null,null,"",null,null,null,null,"","","","",""]
[null,null,null,null,null,null,null,null,"",null,null,null,null,"","","","",""]
[null,null,null,null,null,null,null,null,"",null,null,null,null,"","","","",""]
[null,null,null,null,null,null,null,null,"",null,null,null,null,"","","","",""]
[null,null,null,null,null,null,null,null,"",null,null,null,null,"","","","",""]
[null,null,null,null,null,null,null,null,"",null,null,null,null,"","","","",""]
[null,null,null,null,null,null,null,null,"",null,null,null,null,"","","","",""]
[null,null,null,null,null,null,null,null,"",null,null,null,null,"","","","",""]
[null,null,null,null,null,null,null,null,"",null,null,null,null,"","","","",""]
[null,null,null,null,null,null,null,null,"",null,null,null,null,"","","","",""]
[null,null,null,null,null,null,null,null,"",null,null,null,null,"","","","",""]
[null,null,null,null,null,null,null,null,"",null,null,null,null,"","","","",""]
[null,null,null,null,null,null,null,null,"",null,null,null,null,"","","","",""]
[null,null,null,null,null,null,null,null,"",null,null,null,null,"","","","",""]
[null,null,null,null,null,null,null,null,"",null,null,null,null,"","","","",""]
[null,null,null,null,null,null,null,null,"",null,null,null,null,"","","","",""]
[null,null,null,null,null,null,null,null,"",null,null,null,null,"","","","",""]
[null,null,null,null,null,null,null,null,"",null,null,null,null,"","","","",""]
[null,null,null,null,null,null,null,null,"",null,null,null,null,"","","","",""]
[null,null,null,null,null,null,null,null,"",null,null,null,null,"","","","",""]
[null,null,null,null,null,null,null,null,"",null,null,null,null,"","","","",""]
[null,null,null,null,null,null,null,null,"",null,null,null,null,"","","","",""]
[null,null,null,null,null,null,null,null,"",null,null,null,null,"","","","",""]
[null,null,null,null,null,null,null,null,"",null,null,null,null,"","","","",""]
[null,null,null,null,null,null,null,null,"",null,null,null,null,"","","","",""]
[null,null,null,null,null,null,null,null,"",null,null,null,null,"","","","",""]
[null,null,null,null,null,null,null,null,"",null,null,null,null,"","","","",""]
[null,null,null,null,null,null,null,null,"",null,null,null,null,"","","","",""]
[null,null,null,null,null,null,null,null,"",null,null,null,null,"","","","",""]
[null,null,null,null,null,null,null,null,"",null,null,null,null,"","","","",""]
[null,null,null,null,null,null,null,null,"",null,null,null,null,"","","","",""]
[null,null,null,null,null,null,null,null,"",null,null,null,null,"","","","",""]
[null,null,null,null,null,null,null,null,"",null,null,null,null,"","","","",""]
[null,null,null,null,null,null,null,null,"",null,null,null,null,"","","","",""]
[null,null,null,null,null,null,null,null,"",null,null,null,null,"","","","",""]
[null,null,null,null,null,null,null,null,"",null,null,null,null,"","","","",""]
[null,null,null,null,null,null,null,null,"",null,null,null,null,"","","","",""]
[null,null,null,null,null,null,null,null,"",null,null,null,null,"","","","",""]
[null,null,null,null,null,null,null,null,"",null,null,null,null,"","","","",""]
[null,null,null,null,null,null,null,null,"",null,null,null,null,"","","","",""]
[null,null,null,null,null,null,null,null,"",null,null,null,null,"","","","",""]
[null,null,null,null,null,null,null,null,"",null,null,null,null,"","","","",""]
[null,null,null,null,null,null,null,null,"",null,null,null,null,"","","","",""]
[null,null,null,null,null,null,null,null,"",null,null,null,null,"","","","",""]
[null,null,null,null,null,null,null,null,"",null,null,null,null,"","","","",""]
[null,null,null,null,null,null,null,null,"",null,null,null,null,"","","","",""]
[null,null,null,null,null,null,null,null,"",null,null,null,null,"","","","",""]
[null,null,null,null,null,null,null,null,"",null,null,null,null,"","","","",""]
[null,null,null,null,null,null,null,null,"",null,null,null,null,"","","","",""]
[null,null,null,null,null,null,null,null,"",null,null,null,null,"","","","",""]
[null,null,null,null,null,null,null,null,"",null,null,null,null,"","","","",""]
[null,null,null,null,null,null,null,null,"",null,null,null,null,"","","","",""]
[null,null,null,null,null,null,null,null,"",null,null,null,null,"","","","",""]
[null,null,null,null,null,null,null,null,"",null,null,null,null,"","","","",""]
[null,null,null,null,null,null,null,null,"",null,null,null,null,"","","","",""]
[null,null,null,null,null,null,null,null,"",null,null,null,null,"","","","",""]
[null,null,null,null,null,null,null,null,"",null,null,null,null,"","","","",""]
[null,null,null,null,null,null,null,null,"",null,null,null,null,{"$f":"IF(A392<>\"\",INDEX(Mois_date,MONTH(A392),1),\"\")","v":""},"","","",""]
[null,null,null,null,null,null,null,null,{"$f":"IF(AND(A393<>\"\",YEAR(A393)<>$B$5),\"Erreur date\",\"\")","v":""},null,null,null,null,"",{"$f":"IF(OR(E393<>\"\",F393<>\"\"),E393-F393,\"\")","v":""},{"$f":"IF(AND(D393<>\"\",D393<=TODAY()),\"Perimé\",IF(AND(D393<>\"\",D393<=TODAY()+30),\"Moins d'un mois\",IF(AND(D393<>\"\",D393<=TODAY()+90),\"Moins 3 mois\",IF(AND(D393<>\"\",D393>TODAY()+90),\"Plus 3 mois\",\"\"))))","v":""},{"$f":"IF(OR(N393=\"Janvier\",N393=\"Février\",N393=\"Mars\"),\"Trimestre 1\",IF(OR(N393=\"Avril\",N393=\"Mai\",N393=\"Juin\"),\"Trimestre 2\",IF(OR(N393=\"Juillet\",N393=\"Août\",N393=\"Septembre\"),\"Trimestre 3\",IF(OR(N393=\"Octobre\",N393=\"Novembre\",N393=\"Décembre\"),\"Trimestre 4\",\"\"))))","v":""},{"$f":"IF(OR(Q393=\"Trimestre 1\",Q393=\"Trimestre 2\"),\"Semestre 1\",IF(OR(Q393=\"Trimestre 3\",Q393=\"Trimestre 4\"),\"Semestre 2\",\"\"))","v":""}]
[null,null,null,null,null,null,null,null,"",null,null,null,null,"","","","",""]
[null,null,null,null,null,null,null,null,"",null,null,null,null,"","","","",""]
[null,null,null,null,null,null,null,null,"",null,null,null,null,"","","","",""]
[null,null,null,null,null,null,null,null,"",null,null,null,null,"","","","",""]
[null,null,null,null,null,null,null,null,"",null,null,null,null,"","","","",""]
[null,null,null,null,null,null,null,null,"",null,null,null,null,"","","","",""]
[null,null,null,null,null,null,null,null,"",null,null,null,null,"","","","",""]
[null,null,null,null,null,null,null,null,"",null,null,null,null,"","","","",""]
[null,null,null,null,null,null,null,null,"",null,null,null,null,"","","","",""]
[null,null,null,null,null,null,null,null,"",null,null,null,null,"","","","",""]
[null,null,null,null,null,null,null,null,"",null,null,null,null,"","","","",""]
[null,null,null,null,null,null,null,null,"",null,null,null,null,"","","","",""]
[null,null,null,null,null,null,null,null,"",null,null,null,null,"","","","",""]
[null,null,null,null,null,null,null,null,"",null,null,null,null,"","","","",""]
[null,null,null,null,null,null,null,null,"",null,null,null,null,"","","","",""]
[null,null,null,null,null,null,null,null,"",null,null,null,null,"","","","",""]
[null,null,null,null,null,null,null,null,"",null,null,null,null,"","","","",""]
[null,null,null,null,null,null,null,null,"",null,null,null,null,"","","","",""]
[null,null,null,null,null,null,null,null,"",null,null,null,null,"","","","",""]
[null,null,null,null,null,null,null,null,"",null,null,null,null,"","","","",""]
[null,null,null,null,null,null,null,null,"",null,null,null,null,"","","","",""]
[null,null,null,null,null,null,null,null,"",null,null,null,null,"","","","",""]
[null,null,null,null,null,null,null,null,"",null,null,null,null,"","","","",""]
[null,null,null,null,null,null,null,null,"",null,null,null,null,"","","","",""]
[null,null,null,null,null,null,null,null,"",null,null,null,null,"","","","",""]
[null,null,null,null,null,null,null,null,"",null,null,null,null,"","","","",""]
[null,null,null,null,null,null,null,null,"",null,null,null,null,"","","","",""]
[null,null,null,null,null,null,null,null,"",null,null,null,null,"","","","",""]
[null,null,null,null,null,null,null,null,"",null,null,null,null,"","","","",""]
[null,null,null,null,null,null,null,null,"",null,null,null,null,"","","","",""]
[null,null,null,null,null,null,null,null,"",null,null,null,null,"","","","",""]
[null,null,null,null,null,null,null,null,"",null,null,null,null,"","","","",""]
[null,null,null,null,null,null,null,null,"",null,null,null,null,"","","","",""]
[null,null,null,null,null,null,null,null,"",null,null,null,null,"","","","",""]
[null,null,null,null,null,null,null,null,"",null,null,null,null,"","","","",""]
[null,null,null,null,null,null,null,null,"",null,null,null,null,"","","","",""]
[null,null,null,null,null,null,null,null,"",null,null,null,null,"","","","",""]
[null,null,null,null,null,null,null,null,"",null,null,null,null,"","","","",""]
[null,null,null,null,null,null,null,null,"",null,null,null,null,"","","","",""]
[null,null,null,null,null,null,null,null,"",null,null,null,null,"","","","",""]
[null,null,null,null,null,null,null,null,"",null,null,null,null,"","","","",""]
[null,null,null,null,null,null,null,null,"",null,null,null,null,"","","","",""]
[null,null,null,null,null,null,null,null,"",null,null,null,null,"","","","",""]
[null,null,null,null,null,null,null,null,"",null,null,null,null,"","","","",""]
[null,null,null,null,null,null,null,null,"",null,null,null,null,"","","","",""]
[null,null,null,null,null,null,null,null,"",null,null,null,null,"","","","",""]
[null,null,null,null,null,null,null,null,"",null,null,null,null,"","","","",""]
[null,null,null,null,null,null,null,null,"",null,null,null,null,"","","","",""]
[null,null,null,null,null,null,null,null,"",null,null,null,null,"","","","",""]
[null,null,null,null,null,null,null,null,"",null,null,null,null,"","","","",""]
[null,null,null,null,null,null,null,null,"",null,null,null,null,"","","","",""]
[null,null,null,null,null,null,null,null,"",null,null,null,null,"","","","",""]
[null,null,null,null,null,null,null,null,"",null,null,null,null,"","","","",""]
[null,null,null,null,null,null,null,null,"",null,null,null,null,"","","","",""]
[null,null,null,null,null,null,null,null,"",null,null,null,null,"","","","",""]
[null,null,null,null,null,null,null,null,"",null,null,null,null,"","","","",""]
[null,null,null,null,null,null,null,null,"",null,null,null,null,"","","","",""]
[null,null,null,null,null,null,null,null,"",null,null,null,null,"","","","",""]
[null,null,null,null,null,null,null,null,"",null,null,null,null,"","","","",""]
[null,null,null,null,null,null,null,null,"",null,null,null,null,"","","","",""]
[null,null,null,null,null,null,null,null,"",null,null,null,null,"","","","",""]
[null,null,null,null,null,null,null,null,"",null,null,null,null,"","","","",""]
[null,null,null,null,null,null,null,null,"",null,null,null,null,{"$f":"IF(A456<>\"\",INDEX(Mois_date,MONTH(A456),1),\"\")","v":""},"","","",""]
[null,null,null,null,null,null,null,null,{"$f":"IF(AND(A457<>\"\",YEAR(A457)<>$B$5),\"Erreur date\",\"\")","v":""},null,null,null,null,"",{"$f":"IF(OR(E457<>\"\",F457<>\"\"),E457-F457,\"\")","v":""},{"$f":"IF(AND(D457<>\"\",D457<=TODAY()),\"Perimé\",IF(AND(D457<>\"\",D457<=TODAY()+30),\"Moins d'un mois\",IF(AND(D457<>\"\",D457<=TODAY()+90),\"Moins 3 mois\",IF(AND(D457<>\"\",D457>TODAY()+90),\"Plus 3 mois\",\"\"))))","v":""},{"$f":"IF(OR(N457=\"Janvier\",N457=\"Février\",N457=\"Mars\"),\"Trimestre 1\",IF(OR(N457=\"Avril\",N457=\"Mai\",N457=\"Juin\"),\"Trimestre 2\",IF(OR(N457=\"Juillet\",N457=\"Août\",N457=\"Septembre\"),\"Trimestre 3\",IF(OR(N457=\"Octobre\",N457=\"Novembre\",N457=\"Décembre\"),\"Trimestre 4\",\"\"))))","v":""},{"$f":"IF(OR(Q457=\"Trimestre 1\",Q457=\"Trimestre 2\"),\"Semestre 1\",IF(OR(Q457=\"Trimestre 3\",Q457=\"Trimestre 4\"),\"Semestre 2\",\"\"))","v":""}]
[null,null,null,null,null,null,null,null,"",null,null,null,null,"","","","",""]
[null,null,null,null,null,null,null,null,"",null,null,null,null,"","","","",""]
[null,null,null,null,null,null,null,null,"",null,null,null,null,"","","","",""]
[null,null,null,null,null,null,null,null,"",null,null,null,null,"","","","",""]
[null,null,null,null,null,null,null,null,"",null,null,null,null,"","","","",""]
[null,null,null,null,null,null,null,null,"",null,null,null,null,"","","","",""]
[null,null,null,null,null,null,null,null,"",null,null,null,null,"","","","",""]
[null,null,null,null,null,null,null,null,"",null,null,null,null,"","","","",""]
[null,null,null,null,null,null,null,null,"",null,null,null,null,"","","","",""]
[null,null,null,null,null,null,null,null,"",null,null,null,null,"","","","",""]
[null,null,null,null,null,null,null,null,"",null,null,null,null,"","","","",""]
[null,null,null,null,null,null,null,null,"",null,null,null,null,"","","","",""]
[null,null,null,null,null,null,null,null,"",null,null,null,null,"","","","",""]
[null,null,null,null,null,null,null,null,"",null,null,null,null,"","","","",""]
[null,null,null,null,null,null,null,null,"",null,null,null,null,"","","","",""]
[null,null,null,null,null,null,null,null,"",null,null,null,null,"","","","",""]
[null,null,null,null,null,null,null,null,"",null,null,null,null,"","","","",""]
[null,null,null,null,null,null,null,null,"",null,null,null,null,"","","","",""]
[null,null,null,null,null,null,null,null,"",null,null,null,null,"","","","",""]
[null,null,null,null,null,null,null,null,"",null,null,null,null,"","","","",""]
[null,null,null,null,null,null,null,null,"",null,null,null,null,"","","","",""]
[null,null,null,null,null,null,null,null,"",null,null,null,null,"","","","",""]
[null,null,null,null,null,null,null,null,"",null,null,null,null,"","","","",""]
[null,null,null,null,null,null,null,null,"",null,null,null,null,"","","","",""]
[null,null,null,null,null,null,null,null,"",null,null,null,null,"","","","",""]
[null,null,null,null,null,null,null,null,"",null,null,null,null,"","","","",""]
[null,null,null,null,null,null,null,null,"",null,null,null,null,"","","","",""]
[null,null,null,null,null,null,null,null,"",null,null,null,null,"","","","",""]
[null,null,null,null,null,null,null,null,"",null,null,null,null,"","","","",""]
[null,null,null,null,null,null,null,null,"",null,null,null,null,"","","","",""]
[null,null,null,null,null,null,null,null,"",null,null,null,null,"","","","",""]
[null,null,null,null,null,null,null,null,"",null,null,null,null,"","","","",""]
[null,null,null,null,null,null,null,null,"",null,null,null,null,"","","","",""]
[null,null,null,null,null,null,null,null,"",null,null,null,null,"","","","",""]
[null,null,null,null,null,null,null,null,"",null,null,null,null,"","","","",""]
[null,null,null,null,null,null,null,null,"",null,null,null,null,"","","","",""]
[null,null,null,null,null,null,null,null,"",null,null,null,null,"","","","",""]
[null,null,null,null,null,null,null,null,"",null,null,null,null,"","","","",""]
[null,null,null,null,null,null,null,null,"",null,null,null,null,"","","","",""]
[null,null,null,null,null,null,null,null,"",null,null,null,null,"","","","",""]
[null,null,null,null,null,null,null,null,"",null,null,null,null,"","","","",""]
[null,null,null,null,null,null,null,null,"",null,null,null,null,"","","","",""]
[null,null,null,null,null,null,null,null,"",null,null,null,null,"","","","",""]
[null,null,null,null,null,null,null,null,"",null,null,null,null,"","","","",""]
[null,null,null,null,null,null,null,null,"",null,null,null,null,"","","","",""]
[null,null,null,null,null,null,null,null,"",null,null,null,null,"","","","",""]
[null,null,null,null,null,null,null,null,"",null,null,null,null,"","","","",""]
[null,null,null,null,null,null,null,null,"",null,null,null,null,"","","","",""]
[null,null,null,null,null,null,null,null,"",null,null,null,null,"","","","",""]
[null,null,null,null,null,null,null,null,"",null,null,null,null,"","","","",""]
[null,null,null,null,null,null,null,null,"",null,null,null,null,"","","","",""]
[null,null,null,null,null,null,null,null,"",null,null,null,null,"","","","",""]
[null,null,null,null,null,null,null,null,"",null,null,null,null,"","","","",""]
[null,null,null,null,null,null,null,null,"",null,null,null,null,"","","","",""]
[null,null,null,null,null,null,null,null,"",null,null,null,null,"","","","",""]
[null,null,null,null,null,null,null,null,"",null,null,null,null,"","","","",""]
[null,null,null,null,null,null,null,null,"",null,null,null,null,"","","","",""]
[null,null,null,null,null,null,null,null,"",null,null,null,null,"","","","",""]
[null,null,null,null,null,null,null,null,"",null,null,null,null,"","","","",""]
[null,null,null,null,null,null,null,null,"",null,null,null,null,"","","","",""]
[null,null,null,null,null,null,null,null,"",null,null,null,null,"","","","",""]
[null,null,null,null,null,null,null,null,"",null,null,null,null,"","","","",""]
[null,null,null,null,null,null,null,null,"",null,null,null,null,{"$f":"IF(A520<>\"\",INDEX(Mois_date,MONTH(A520),1),\"\")","v":""},"","","",""]
[null,null,null,null,null,null,null,null,{"$f":"IF(AND(A521<>\"\",YEAR(A521)<>$B$5),\"Erreur date\",\"\")","v":""},null,null,null,null,"",{"$f":"IF(OR(E521<>\"\",F521<>\"\"),E521-F521,\"\")","v":""},{"$f":"IF(AND(D521<>\"\",D521<=TODAY()),\"Perimé\",IF(AND(D521<>\"\",D521<=TODAY()+30),\"Moins d'un mois\",IF(AND(D521<>\"\",D521<=TODAY()+90),\"Moins 3 mois\",IF(AND(D521<>\"\",D521>TODAY()+90),\"Plus 3 mois\",\"\"))))","v":""},{"$f":"IF(OR(N521=\"Janvier\",N521=\"Février\",N521=\"Mars\"),\"Trimestre 1\",IF(OR(N521=\"Avril\",N521=\"Mai\",N521=\"Juin\"),\"Trimestre 2\",IF(OR(N521=\"Juillet\",N521=\"Août\",N521=\"Septembre\"),\"Trimestre 3\",IF(OR(N521=\"Octobre\",N521=\"Novembre\",N521=\"Décembre\"),\"Trimestre 4\",\"\"))))","v":""},{"$f":"IF(OR(Q521=\"Trimestre 1\",Q521=\"Trimestre 2\"),\"Semestre 1\",IF(OR(Q521=\"Trimestre 3\",Q521=\"Trimestre 4\"),\"Semestre 2\",\"\"))","v":""}]
[null,null,null,null,null,null,null,null,"",null,null,null,null,"","","","",""]
[null,null,null,null,null,null,null,null,"",null,null,null,null,"","","","",""]
[null,null,null,null,null,null,null,null,"",null,null,null,null,"","","","",""]
[null,null,null,null,null,null,null,null,"",null,null,null,null,"","","","",""]
[null,null,null,null,null,null,null,null,"",null,null,null,null,"","","","",""]
[null,null,null,null,null,null,null,null,"",null,null,null,null,"","","","",""]
[null,null,null,null,null,null,null,null,"",null,null,null,null,"","","","",""]
[null,null,null,null,null,null,null,null,"",null,null,null,null,"","","","",""]
[null,null,null,null,null,null,null,null,"",null,null,null,null,"","","","",""]
[null,null,null,null,null,null,null,null,"",null,null,null,null,"","","","",""]
[null,null,null,null,null,null,null,null,"",null,null,null,null,"","","","",""]
[null,null,null,null,null,null,null,null,"",null,null,null,null,"","","","",""]
[null,null,null,null,null,null,null,null,"",null,null,null,null,"","","","",""]
[null,null,null,null,null,null,null,null,"",null,null,null,null,"","","","",""]
[null,null,null,null,null,null,null,null,"",null,null,null,null,"","","","",""]
[null,null,null,null,null,null,null,null,"",null,null,null,null,"","","","",""]
[null,null,null,null,null,null,null,null,"",null,null,null,null,"","","","",""]
[null,null,null,null,null,null,null,null,"",null,null,null,null,"","","","",""]
[null,null,null,null,null,null,null,null,"",null,null,null,null,"","","","",""]
[null,null,null,null,null,null,null,null,"",null,null,null,null,"","","","",""]
[null,null,null,null,null,null,null,null,"",null,null,null,null,"","","","",""]
[null,null,null,null,null,null,null,null,"",null,null,null,null,"","","","",""]
[null,null,null,null,null,null,null,null,"",null,null,null,null,"","","","",""]
[null,null,null,null,null,null,null,null,"",null,null,null,null,"","","","",""]
[null,null,null,null,null,null,null,null,"",null,null,null,null,"","","","",""]
[null,null,null,null,null,null,null,null,"",null,null,null,null,"","","","",""]
[null,null,null,null,null,null,null,null,"",null,null,null,null,"","","","",""]
[null,null,null,null,null,null,null,null,"",null,null,null,null,"","","","",""]
[null,null,null,null,null,null,null,null,"",null,null,null,null,"","","","",""]
[null,null,null,null,null,null,null,null,"",null,null,null,null,"","","","",""]
[null,null,null,null,null,null,null,null,"",null,null,null,null,"","","","",""]
[null,null,null,null,null,null,null,null,"",null,null,null,null,"","","","",""]
[null,null,null,null,null,null,null,null,"",null,null,null,null,"","","","",""]
[null,null,null,null,null,null,null,null,"",null,null,null,null,"","","","",""]
[null,null,null,null,null,null,null,null,"",null,null,null,null,"","","","",""]
[null,null,null,null,null,null,null,null,"",null,null,null,null,"","","","",""]
[null,null,null,null,null,null,null,null,"",null,null,null,null,"","","","",""]
[null,null,null,null,null,null,null,null,"",null,null,null,null,"","","","",""]
[null,null,null,null,null,null,null,null,"",null,null,null,null,"","","","",""]
[null,null,null,null,null,null,null,null,"",null,null,null,null,"","","","",""]
[null,null,null,null,null,null,null,null,"",null,null,null,null,"","","","",""]
[null,null,null,null,null,null,null,null,"",null,null,null,null,"","","","",""]
[null,null,null,null,null,null,null,null,"",null,null,null,null,"","","","",""]
[null,null,null,null,null,null,null,null,"",null,null,null,null,"","","","",""]
[null,null,null,null,null,null,null,null,"",null,null,null,null,"","","","",""]
[null,null,null,null,null,null,null,null,"",null,null,null,null,"","","","",""]
[null,null,null,null,null,null,null,null,"",null,null,null,null,"","","","",""]
[null,null,null,null,null,null,null,null,"",null,null,null,null,"","","","",""]
[null,null,null,null,null,null,null,null,"",null,null,null,null,"","","","",""]
[null,null,null,null,null,null,null,null,"",null,null,null,null,"","","","",""]
[null,null,null,null,null,null,null,null,"",null,null,null,null,"","","","",""]
[null,null,null,null,null,null,null,null,"",null,null,null,null,"","","","",""]
[null,null,null,null,null,null,null,null,"",null,null,null,null,"","","","",""]
[null,null,null,null,null,null,null,null,"",null,null,null,null,"","","","",""]
[null,null,null,null,null,null,null,null,"",null,null,null,null,"","","","",""]
[null,null,null,null,null,null,null,null,"",null,null,null,null,"","","","",""]
[null,null,null,null,null,null,null,null,"",null,null,null,null,"","","","",""]
[null,null,null,null,null,null,null,null,"",null,null,null,null,"","","","",""]
[null,null,null,null,null,null,null,null,"",null,null,null,null,"","","","",""]
[null,null,null,null,null,null,null,null,"",null,null,null,null,"","","","",""]
[null,null,null,null,null,null,null,null,"",null,null,null,null,"","","","",""]
[null,null,null,null,null,null,null,null,"",null,null,null,null,"","","","",""]
[null,null,null,null,null,null,null,null,"",null,null,null,null,{"$f":"IF(A584<>\"\",INDEX(Mois_date,MONTH(A584),1),\"\")","v":""},"","","",""]
[null,null,null,null,null,null,null,null,{"$f":"IF(AND(A585<>\"\",YEAR(A585)<>$B$5),\"Erreur date\",\"\")","v":""},null,null,null,null,"",{"$f":"IF(OR(E585<>\"\",F585<>\"\"),E585-F585,\"\")","v":""},{"$f":"IF(AND(D585<>\"\",D585<=TODAY()),\"Perimé\",IF(AND(D585<>\"\",D585<=TODAY()+30),\"Moins d'un mois\",IF(AND(D585<>\"\",D585<=TODAY()+90),\"Moins 3 mois\",IF(AND(D585<>\"\",D585>TODAY()+90),\"Plus 3 mois\",\"\"))))","v":""},{"$f":"IF(OR(N585=\"Janvier\",N585=\"Février\",N585=\"Mars\"),\"Trimestre 1\",IF(OR(N585=\"Avril\",N585=\"Mai\",N585=\"Juin\"),\"Trimestre 2\",IF(OR(N585=\"Juillet\",N585=\"Août\",N585=\"Septembre\"),\"Trimestre 3\",IF(OR(N585=\"Octobre\",N585=\"Novembre\",N585=\"Décembre\"),\"Trimestre 4\",\"\"))))","v":""},{"$f":"IF(OR(Q585=\"Trimestre 1\",Q585=\"Trimestre 2\"),\"Semestre 1\",IF(OR(Q585=\"Trimestre 3\",Q585=\"Trimestre 4\"),\"Semestre 2\",\"\"))","v":""}]
[null,null,null,null,null,null,null,null,"",null,null,null,null,"","","","",""]
[null,null,null,null,null,null,null,null,"",null,null,null,null,"","","","",""]
[null,null,null,null,null,null,null,null,"",null,null,null,null,"","","","",""]
[null,null,null,null,null,null,null,null,"",null,null,null,null,"","","","",""]
[null,null,null,null,null,null,null,null,"",null,null,null,null,"","","","",""]
[null,null,null,null,null,null,null,null,"",null,null,null,null,"","","","",""]
[null,null,null,null,null,null,null,null,"",null,null,null,null,"","","","",""]
[null,null,null,null,null,null,null,null,"",null,null,null,null,"","","","",""]
[null,null,null,null,null,null,null,null,"",null,null,null,null,"","","","",""]
[null,null,null,null,null,null,null,null,"",null,null,null,null,"","","","",""]
[null,null,null,null,null,null,null,null,"",null,null,null,null,"","","","",""]
[null,null,null,null,null,null,null,null,"",null,null,null,null,"","","","",""]
[null,null,null,null,null,null,null,null,"",null,null,null,null,"","","","",""]
[null,null,null,null,null,null,null,null,"",null,null,null,null,"","","","",""]
[null,null,null,null,null,null,null,null,"",null,null,null,null,"","","","",""]
[null,null,null,null,null,null,null,null,"",null,null,null,null,"","","","",""]
[null,null,null,null,null,null,null,null,"",null,null,null,null,"","","","",""]
[null,null,null,null,null,null,null,null,"",null,null,null,null,"","","","",""]
[null,null,null,null,null,null,null,null,"",null,null,null,null,"","","","",""]
[null,null,null,null,null,null,null,null,"",null,null,null,null,"","","","",""]
[null,null,null,null,null,null,null,null,"",null,null,null,null,"","","","",""]
[null,null,null,null,null,null,null,null,"",null,null,null,null,"","","","",""]
[null,null,null,null,null,null,null,null,"",null,null,null,null,"","","","",""]
[null,null,null,null,null,null,null,null,"",null,null,null,null,"","","","",""]
[null,null,null,null,null,null,null,null,"",null,null,null,null,"","","","",""]
[null,null,null,null,null,null,null,null,"",null,null,null,null,"","","","",""]
[null,null,null,null,null,null,null,null,"",null,null,null,null,"","","","",""]
[null,null,null,null,null,null,null,null,"",null,null,null,null,"","","","",""]
[null,null,null,null,null,null,null,null,"",null,null,null,null,"","","","",""]
[null,null,null,null,null,null,null,null,"",null,null,null,null,"","","","",""]
[null,null,null,null,null,null,null,null,"",null,null,null,null,"","","","",""]
[null,null,null,null,null,null,null,null,"",null,null,null,null,"","","","",""]
[null,null,null,null,null,null,null,null,"",null,null,null,null,"","","","",""]
[null,null,null,null,null,null,null,null,"",null,null,null,null,"","","","",""]
[null,null,null,null,null,null,null,null,"",null,null,null,null,"","","","",""]
[null,null,null,null,null,null,null,null,"",null,null,null,null,"","","","",""]
[null,null,null,null,null,null,null,null,"",null,null,null,null,"","","","",""]
[null,null,null,null,null,null,null,null,"",null,null,null,null,"","","","",""]
[null,null,null,null,null,null,null,null,"",null,null,null,null,"","","","",""]
[null,null,null,null,null,null,null,null,"",null,null,null,null,"","","","",""]
[null,null,null,null,null,null,null,null,"",null,null,null,null,"","","","",""]
[null,null,null,null,null,null,null,null,"",null,null,null,null,"","","","",""]
[null,null,null,null,null,null,null,null,"",null,null,null,null,"","","","",""]
[null,null,null,null,null,null,null,null,"",null,null,null,null,"","","","",""]
[null,null,null,null,null,null,null,null,"",null,null,null,null,"","","","",""]
[null,null,null,null,null,null,null,null,"",null,null,null,null,"","","","",""]
[null,null,null,null,null,null,null,null,"",null,null,null,null,"","","","",""]
[null,null,null,null,null,null,null,null,"",null,null,null,null,"","","","",""]
[null,null,null,null,null,null,null,null,"",null,null,null,null,"","","","",""]
[null,null,null,null,null,null,null,null,"",null,null,null,null,"","","","",""]
[null,null,null,null,null,null,null,null,"",null,null,null,null,"","","","",""]
[null,null,null,null,null,null,null,null,"",null,null,null,null,"","","","",""]
[null,null,null,null,null,null,null,null,"",null,null,null,null,"","","","",""]
[null,null,null,null,null,null,null,null,"",null,null,null,null,"","","","",""]
[null,null,null,null,null,null,null,null,"",null,null,null,null,"","","","",""]
[null,null,null,null,null,null,null,null,"",null,null,null,null,"","","","",""]
[null,null,null,null,null,null,null,null,"",null,null,null,null,"","","","",""]
[null,null,null,null,null,null,null,null,"",null,null,null,null,"","","","",""]
[null,null,null,null,null,null,null,null,"",null,null,null,null,"","","","",""]
[null,null,null,null,null,null,null,null,"",null,null,null,null,"","","","",""]
[null,null,null,null,null,null,null,null,"",null,null,null,null,"","","","",""]
[null,null,null,null,null,null,null,null,"",null,null,null,null,"","","","",""]
[null,null,null,null,null,null,null,null,"",null,null,null,null,{"$f":"IF(A648<>\"\",INDEX(Mois_date,MONTH(A648),1),\"\")","v":""},"","","",""]
[null,null,null,null,null,null,null,null,{"$f":"IF(AND(A649<>\"\",YEAR(A649)<>$B$5),\"Erreur date\",\"\")","v":""},null,null,null,null,"",{"$f":"IF(OR(E649<>\"\",F649<>\"\"),E649-F649,\"\")","v":""},{"$f":"IF(AND(D649<>\"\",D649<=TODAY()),\"Perimé\",IF(AND(D649<>\"\",D649<=TODAY()+30),\"Moins d'un mois\",IF(AND(D649<>\"\",D649<=TODAY()+90),\"Moins 3 mois\",IF(AND(D649<>\"\",D649>TODAY()+90),\"Plus 3 mois\",\"\"))))","v":""},{"$f":"IF(OR(N649=\"Janvier\",N649=\"Février\",N649=\"Mars\"),\"Trimestre 1\",IF(OR(N649=\"Avril\",N649=\"Mai\",N649=\"Juin\"),\"Trimestre 2\",IF(OR(N649=\"Juillet\",N649=\"Août\",N649=\"Septembre\"),\"Trimestre 3\",IF(OR(N649=\"Octobre\",N649=\"Novembre\",N649=\"Décembre\"),\"Trimestre 4\",\"\"))))","v":""},{"$f":"IF(OR(Q649=\"Trimestre 1\",Q649=\"Trimestre 2\"),\"Semestre 1\",IF(OR(Q649=\"Trimestre 3\",Q649=\"Trimestre 4\"),\"Semestre 2\",\"\"))","v":""}]
[null,null,null,null,null,null,null,null,"",null,null,null,null,"","","","",""]
[null,null,null,null,null,null,null,null,"",null,null,null,null,"","","","",""]
[null,null,null,null,null,null,null,null,"",null,null,null,null,"","","","",""]
[null,null,null,null,null,null,null,null,"",null,null,null,null,"","","","",""]
[null,null,null,null,null,null,null,null,"",null,null,null,null,"","","","",""]
[null,null,null,null,null,null,null,null,"",null,null,null,null,"","","","",""]
[null,null,null,null,null,null,null,null,"",null,null,null,null,"","","","",""]
[null,null,null,null,null,null,null,null,"",null,null,null,null,"","","","",""]
[null,null,null,null,null,null,null,null,"",null,null,null,null,"","","","",""]
[null,null,null,null,null,null,null,null,"",null,null,null,null,"","","","",""]
[null,null,null,null,null,null,null,null,"",null,null,null,null,"","","","",""]
[null,null,null,null,null,null,null,null,"",null,null,null,null,"","","","",""]
[null,null,null,null,null,null,null,null,"",null,null,null,null,"","","","",""]
[null,null,null,null,null,null,null,null,"",null,null,null,null,"","","","",""]
[null,null,null,null,null,null,null,null,"",null,null,null,null,"","","","",""]
[null,null,null,null,null,null,null,null,"",null,null,null,null,"","","","",""]
[null,null,null,null,null,null,null,null,"",null,null,null,null,"","","","",""]
[null,null,null,null,null,null,null,null,"",null,null,null,null,"","","","",""]
[null,null,null,null,null,null,null,null,"",null,null,null,null,"","","","",""]
[null,null,null,null,null,null,null,null,"",null,null,null,null,"","","","",""]
[null,null,null,null,null,null,null,null,"",null,null,null,null,"","","","",""]
[null,null,null,null,null,null,null,null,"",null,null,null,null,"","","","",""]
[null,null,null,null,null,null,null,null,"",null,null,null,null,"","","","",""]
[null,null,null,null,null,null,null,null,"",null,null,null,null,"","","","",""]
[null,null,null,null,null,null,null,null,"",null,null,null,null,"","","","",""]
[null,null,null,null,null,null,null,null,"",null,null,null,null,"","","","",""]
[null,null,null,null,null,null,null,null,"",null,null,null,null,"","","","",""]
[null,null,null,null,null,null,null,null,"",null,null,null,null,"","","","",""]
[null,null,null,null,null,null,null,null,"",null,null,null,null,"","","","",""]
[null,null,null,null,null,null,null,null,"",null,null,null,null,"","","","",""]
[null,null,null,null,null,null,null,null,"",null,null,null,null,"","","","",""]
[null,null,null,null,null,null,null,null,"",null,null,null,null,"","","","",""]
[null,null,null,null,null,null,null,null,"",null,null,null,null,"","","","",""]
[null,null,null,null,null,null,null,null,"",null,null,null,null,"","","","",""]
[null,null,null,null,null,null,null,null,"",null,null,null,null,"","","","",""]
[null,null,null,null,null,null,null,null,"",null,null,null,null,"","","","",""]
[null,null,null,null,null,null,null,null,"",null,null,null,null,"","","","",""]
[null,null,null,null,null,null,null,null,"",null,null,null,null,"","","","",""]
[null,null,null,null,null,null,null,null,"",null,null,null,null,"","","","",""]
[null,null,null,null,null,null,null,null,"",null,null,null,null,"","","","",""]
[null,null,null,null,null,null,null,null,"",null,null,null,null,"","","","",""]
[null,null,null,null,null,null,null,null,"",null,null,null,null,"","","","",""]
[null,null,null,null,null,null,null,null,"",null,null,null,null,"","","","",""]
[null,null,null,null,null,null,null,null,"",null,null,null,null,"","","","",""]
[null,null,null,null,null,null,null,null,"",null,null,null,null,"","","","",""]
[null,null,null,null,null,null,null,null,"",null,null,null,null,"","","","",""]
[null,null,null,null,null,null,null,null,"",null,null,null,null,"","","","",""]
[null,null,null,null,null,null,null,null,"",null,null,null,null,"","","","",""]
[null,null,null,null,null,null,null,null,"",null,null,null,null,"","","","",""]
[null,null,null,null,null,null,null,null,"",null,null,null,null,"","","","",""]
[null,null,null,null,null,null,null,null,"",null,null,null,null,"","","","",""]
[null,null,null,null,null,null,null,null,"",null,null,null,null,"","","","",""]
[null,null,null,null,null,null,null,null,"",null,null,null,null,"","","","",""]
[null,null,null,null,null,null,null,null,"",null,null,null,null,"","","","",""]
[null,null,null,null,null,null,null,null,"",null,null,null,null,"","","","",""]
[null,null,null,null,null,null,null,null,"",null,null,null,null,"","","","",""]
[null,null,null,null,null,null,null,null,"",null,null,null,null,"","","","",""]
[null,null,null,null,null,null,null,null,"",null,null,null,null,"","","","",""]
[null,null,null,null,null,null,null,null,"",null,null,null,null,"","","","",""]
[null,null,null,null,null,null,null,null,"",null,null,null,null,"","","","",""]
[null,null,null,null,null,null,null,null,"",null,null,null,null,"","","","",""]
[null,null,null,null,null,null,null,null,"",null,null,null,null,"","","","",""]
[null,null,null,null,null,null,null,null,"",null,null,null,null,{"$f":"IF(A712<>\"\",INDEX(Mois_date,MONTH(A712),1),\"\")","v":""},"","","",""]
[null,null,null,null,null,null,null,null,{"$f":"IF(AND(A713<>\"\",YEAR(A713)<>$B$5),\"Erreur date\",\"\")","v":""},null,null,null,null,"",{"$f":"IF(OR(E713<>\"\",F713<>\"\"),E713-F713,\"\")","v":""},{"$f":"IF(AND(D713<>\"\",D713<=TODAY()),\"Perimé\",IF(AND(D713<>\"\",D713<=TODAY()+30),\"Moins d'un mois\",IF(AND(D713<>\"\",D713<=TODAY()+90),\"Moins 3 mois\",IF(AND(D713<>\"\",D713>TODAY()+90),\"Plus 3 mois\",\"\"))))","v":""},{"$f":"IF(OR(N713=\"Janvier\",N713=\"Février\",N713=\"Mars\"),\"Trimestre 1\",IF(OR(N713=\"Avril\",N713=\"Mai\",N713=\"Juin\"),\"Trimestre 2\",IF(OR(N713=\"Juillet\",N713=\"Août\",N713=\"Septembre\"),\"Trimestre 3\",IF(OR(N713=\"Octobre\",N713=\"Novembre\",N713=\"Décembre\"),\"Trimestre 4\",\"\"))))","v":""},{"$f":"IF(OR(Q713=\"Trimestre 1\",Q713=\"Trimestre 2\"),\"Semestre 1\",IF(OR(Q713=\"Trimestre 3\",Q713=\"Trimestre 4\"),\"Semestre 2\",\"\"))","v":""}]
[null,null,null,null,null,null,null,null,"",null,null,null,null,"","","","",""]
[null,null,null,null,null,null,null,null,"",null,null,null,null,"","","","",""]
[null,null,null,null,null,null,null,null,"",null,null,null,null,"","","","",""]
[null,null,null,null,null,null,null,null,"",null,null,null,null,"","","","",""]
[null,null,null,null,null,null,null,null,"",null,null,null,null,"","","","",""]
[null,null,null,null,null,null,null,null,"",null,null,null,null,"","","","",""]
[null,null,null,null,null,null,null,null,"",null,null,null,null,"","","","",""]
[null,null,null,null,null,null,null,null,"",null,null,null,null,"","","","",""]
[null,null,null,null,null,null,null,null,"",null,null,null,null,"","","","",""]
[null,null,null,null,null,null,null,null,"",null,null,null,null,"","","","",""]
[null,null,null,null,null,null,null,null,"",null,null,null,null,"","","","",""]
[null,null,null,null,null,null,null,null,"",null,null,null,null,"","","","",""]
[null,null,null,null,null,null,null,null,"",null,null,null,null,"","","","",""]
[null,null,null,null,null,null,null,null,"",null,null,null,null,"","","","",""]
[null,null,null,null,null,null,null,null,"",null,null,null,null,"","","","",""]
[null,null,null,null,null,null,null,null,"",null,null,null,null,"","","","",""]
[null,null,null,null,null,null,null,null,"",null,null,null,null,"","","","",""]
[null,null,null,null,null,null,null,null,"",null,null,null,null,"","","","",""]
[null,null,null,null,null,null,null,null,"",null,null,null,null,"","","","",""]
[null,null,null,null,null,null,null,null,"",null,null,null,null,"","","","",""]
[null,null,null,null,null,null,null,null,"",null,null,null,null,"","","","",""]
[null,null,null,null,null,null,null,null,"",null,null,null,null,"","","","",""]
[null,null,null,null,null,null,null,null,"",null,null,null,null,"","","","",""]
[null,null,null,null,null,null,null,null,"",null,null,null,null,"","","","",""]
[null,null,null,null,null,null,null,null,"",null,null,null,null,"","","","",""]
[null,null,null,null,null,null,null,null,"",null,null,null,null,"","","","",""]
[null,null,null,null,null,null,null,null,"",null,null,null,null,"","","","",""]
[null,null,null,null,null,null,null,null,"",null,null,null,null,"","","","",""]
[null,null,null,null,null,null,null,null,"",null,null,null,null,"","","","",""]
[null,null,null,null,null,null,null,null,"",null,null,null,null,"","","","",""]
[null,null,null,null,null,null,null,null,"",null,null,null,null,"","","","",""]
[null,null,null,null,null,null,null,null,"",null,null,null,null,"","","","",""]
[null,null,null,null,null,null,null,null,"",null,null,null,null,"","","","",""]
[null,null,null,null,null,null,null,null,"",null,null,null,null,"","","","",""]
[null,null,null,null,null,null,null,null,"",null,null,null,null,"","","","",""]
[null,null,null,null,null,null,null,null,"",null,null,null,null,"","","","",""]
[null,null,null,null,null,null,null,null,"",null,null,null,null,"","","","",""]
[null,null,null,null,null,null,null,null,"",null,null,null,null,"","","","",""]
[null,null,null,null,null,null,null,null,"",null,null,null,null,"","","","",""]
[null,null,null,null,null,null,null,null,"",null,null,null,null,"","","","",""]
[null,null,null,null,null,null,null,null,"",null,null,null,null,"","","","",""]
[null,null,null,null,null,null,null,null,"",null,null,null,null,"","","","",""]
[null,null,null,null,null,null,null,null,"",null,null,null,null,"","","","",""]
[null,null,null,null,null,null,null,null,"",null,null,null,null,"","","","",""]
[null,null,null,null,null,null,null,null,"",null,null,null,null,"","","","",""]
[null,null,null,null,null,null,null,null,"",null,null,null,null,"","","","",""]
[null,null,null,null,null,null,null,null,"",null,null,null,null,"","","","",""]
[null,null,null,null,null,null,null,null,"",null,null,null,null,"","","","",""]
[null,null,null,null,null,null,null,null,"",null,null,null,null,"","","","",""]
[null,null,null,null,null,null,null,null,"",null,null,null,null,"","","","",""]
[null,null,null,null,null,null,null,null,"",null,null,null,null,"","","","",""]
[null,null,null,null,null,null,null,null,"",null,null,null,null,"","","","",""]
[null,null,null,null,null,null,null,null,"",null,null,null,null,"","","","",""]
[null,null,null,null,null,null,null,null,"",null,null,null,null,"","","","",""]
[null,null,null,null,null,null,null,null,"",null,null,null,null,"","","","",""]
[null,null,null,null,null,null,null,null,"",null,null,null,null,"","","","",""]
[null,null,null,null,null,null,null,null,"",null,null,null,null,"","","","",""]
[null,null,null,null,null,null,null,null,"",null,null,null,null,"","","","",""]
[null,null,null,null,null,null,null,null,"",null,null,null,null,"","","","",""]
[null,null,null,null,null,null,null,null,"",null,null,null,null,"","","","",""]
[null,null,null,null,null,null,null,null,"",null,null,null,null,"","","","",""]
[null,null,null,null,null,null,null,null,"",null,null,null,null,"","","","",""]
[null,null,null,null,null,null,null,null,"",null,null,null,null,{"$f":"IF(A776<>\"\",INDEX(Mois_date,MONTH(A776),1),\"\")","v":""},"","","",""]
[null,null,null,null,null,null,null,null,{"$f":"IF(AND(A777<>\"\",YEAR(A777)<>$B$5),\"Erreur date\",\"\")","v":""},null,null,null,null,"",{"$f":"IF(OR(E777<>\"\",F777<>\"\"),E777-F777,\"\")","v":""},{"$f":"IF(AND(D777<>\"\",D777<=TODAY()),\"Perimé\",IF(AND(D777<>\"\",D777<=TODAY()+30),\"Moins d'un mois\",IF(AND(D777<>\"\",D777<=TODAY()+90),\"Moins 3 mois\",IF(AND(D777<>\"\",D777>TODAY()+90),\"Plus 3 mois\",\"\"))))","v":""},{"$f":"IF(OR(N777=\"Janvier\",N777=\"Février\",N777=\"Mars\"),\"Trimestre 1\",IF(OR(N777=\"Avril\",N777=\"Mai\",N777=\"Juin\"),\"Trimestre 2\",IF(OR(N777=\"Juillet\",N777=\"Août\",N777=\"Septembre\"),\"Trimestre 3\",IF(OR(N777=\"Octobre\",N777=\"Novembre\",N777=\"Décembre\"),\"Trimestre 4\",\"\"))))","v":""},{"$f":"IF(OR(Q777=\"Trimestre 1\",Q777=\"Trimestre 2\"),\"Semestre 1\",IF(OR(Q777=\"Trimestre 3\",Q777=\"Trimestre 4\"),\"Semestre 2\",\"\"))","v":""}]
[null,null,null,null,null,null,null,null,"",null,null,null,null,"","","","",""]
[null,null,null,null,null,null,null,null,"",null,null,null,null,"","","","",""]
[null,null,null,null,null,null,null,null,"",null,null,null,null,"","","","",""]
[null,null,null,null,null,null,null,null,"",null,null,null,null,"","","","",""]
[null,null,null,null,null,null,null,null,"",null,null,null,null,"","","","",""]
[null,null,null,null,null,null,null,null,"",null,null,null,null,"","","","",""]
[null,null,null,null,null,null,null,null,"",null,null,null,null,"","","","",""]
[null,null,null,null,null,null,null,null,"",null,null,null,null,"","","","",""]
[null,null,null,null,null,null,null,null,"",null,null,null,null,"","","","",""]
[null,null,null,null,null,null,null,null,"",null,null,null,null,"","","","",""]
[null,null,null,null,null,null,null,null,"",null,null,null,null,"","","","",""]
[null,null,null,null,null,null,null,null,"",null,null,null,null,"","","","",""]
[null,null,null,null,null,null,null,null,"",null,null,null,null,"","","","",""]
[null,null,null,null,null,null,null,null,"",null,null,null,null,"","","","",""]
[null,null,null,null,null,null,null,null,"",null,null,null,null,"","","","",""]
[null,null,null,null,null,null,null,null,"",null,null,null,null,"","","","",""]
[null,null,null,null,null,null,null,null,"",null,null,null,null,"","","","",""]
[null,null,null,null,null,null,null,null,"",null,null,null,null,"","","","",""]
[null,null,null,null,null,null,null,null,"",null,null,null,null,"","","","",""]
[null,null,null,null,null,null,null,null,"",null,null,null,null,"","","","",""]
[null,null,null,null,null,null,null,null,"",null,null,null,null,"","","","",""]
[null,null,null,null,null,null,null,null,"",null,null,null,null,"","","","",""]
[null,null,null,null,null,null,null,null,"",null,null,null,null,"","","","",""]
[null,null,null,null,null,null,null,null,"",null,null,null,null,"","","","",""]
[null,null,null,null,null,null,null,null,"",null,null,null,null,"","","","",""]
[null,null,null,null,null,null,null,null,"",null,null,null,null,"","","","",""]
[null,null,null,null,null,null,null,null,"",null,null,null,null,"","","","",""]
[null,null,null,null,null,null,null,null,"",null,null,null,null,"","","","",""]
[null,null,null,null,null,null,null,null,"",null,null,null,null,"","","","",""]
[null,null,null,null,null,null,null,null,"",null,null,null,null,"","","","",""]
[null,null,null,null,null,null,null,null,"",null,null,null,null,"","","","",""]
[null,null,null,null,null,null,null,null,"",null,null,null,null,"","","","",""]
[null,null,null,null,null,null,null,null,"",null,null,null,null,"","","","",""]
[null,null,null,null,null,null,null,null,"",null,null,null,null,"","","","",""]
[null,null,null,null,null,null,null,null,"",null,null,null,null,"","","","",""]
[null,null,null,null,null,null,null,null,"",null,null,null,null,"","","","",""]
[null,null,null,null,null,null,null,null,"",null,null,null,null,"","","","",""]
[null,null,null,null,null,null,null,null,"",null,null,null,null,"","","","",""]
[null,null,null,null,null,null,null,null,"",null,null,null,null,"","","","",""]
[null,null,null,null,null,null,null,null,"",null,null,null,null,"","","","",""]
[null,null,null,null,null,null,null,null,"",null,null,null,null,"","","","",""]
[null,null,null,null,null,null,null,null,"",null,null,null,null,"","","","",""]
[null,null,null,null,null,null,null,null,"",null,null,null,null,"","","","",""]
[null,null,null,null,null,null,null,null,"",null,null,null,null,"","","","",""]
[null,null,null,null,null,null,null,null,"",null,null,null,null,"","","","",""]
[null,null,null,null,null,null,null,null,"",null,null,null,null,"","","","",""]
[null,null,null,null,null,null,null,null,"",null,null,null,null,"","","","",""]
[null,null,null,null,null,null,null,null,"",null,null,null,null,"","","","",""]
[null,null,null,null,null,null,null,null,"",null,null,null,null,"","","","",""]
[null,null,null,null,null,null,null,null,"",null,null,null,null,"","","","",""]
[null,null,null,null,null,null,null,null,"",null,null,null,null,"","","","",""]
[null,null,null,null,null,null,null,null,"",null,null,null,null,"","","","",""]
[null,null,null,null,null,null,null,null,"",null,null,null,null,"","","","",""]
[null,null,null,null,null,null,null,null,"",null,null,null,null,"","","","",""]
[null,null,null,null,null,null,null,null,"",null,null,null,null,"","","","",""]
[null,null,null,null,null,null,null,null,"",null,null,null,null,"","","","",""]
[null,null,null,null,null,null,null,null,"",null,null,null,null,"","","","",""]
[null,null,null,null,null,null,null,null,"",null,null,null,null,"","","","",""]
[null,null,null,null,null,null,null,null,"",null,null,null,null,"","","","",""]
[null,null,null,null,null,null,null,null,"",null,null,null,null,"","","","",""]
[null,null,null,null,null,null,null,null,"",null,null,null,null,"","","","",""]
[null,null,null,null,null,null,null,null,"",null,null,null,null,"","","","",""]
[null,null,null,null,null,null,null,null,"",null,null,null,null,{"$f":"IF(A840<>\"\",INDEX(Mois_date,MONTH(A840),1),\"\")","v":""},"","","",""]
[null,null,null,null,null,null,null,null,{"$f":"IF(AND(A841<>\"\",YEAR(A841)<>$B$5),\"Erreur date\",\"\")","v":""},null,null,null,null,"",{"$f":"IF(OR(E841<>\"\",F841<>\"\"),E841-F841,\"\")","v":""},{"$f":"IF(AND(D841<>\"\",D841<=TODAY()),\"Perimé\",IF(AND(D841<>\"\",D841<=TODAY()+30),\"Moins d'un mois\",IF(AND(D841<>\"\",D841<=TODAY()+90),\"Moins 3 mois\",IF(AND(D841<>\"\",D841>TODAY()+90),\"Plus 3 mois\",\"\"))))","v":""},{"$f":"IF(OR(N841=\"Janvier\",N841=\"Février\",N841=\"Mars\"),\"Trimestre 1\",IF(OR(N841=\"Avril\",N841=\"Mai\",N841=\"Juin\"),\"Trimestre 2\",IF(OR(N841=\"Juillet\",N841=\"Août\",N841=\"Septembre\"),\"Trimestre 3\",IF(OR(N841=\"Octobre\",N841=\"Novembre\",N841=\"Décembre\"),\"Trimestre 4\",\"\"))))","v":""},{"$f":"IF(OR(Q841=\"Trimestre 1\",Q841=\"Trimestre 2\"),\"Semestre 1\",IF(OR(Q841=\"Trimestre 3\",Q841=\"Trimestre 4\"),\"Semestre 2\",\"\"))","v":""}]
[null,null,null,null,null,null,null,null,"",null,null,null,null,"","","","",""]
[null,null,null,null,null,null,null,null,"",null,null,null,null,"","","","",""]
[null,null,null,null,null,null,null,null,"",null,null,null,null,"","","","",""]
[null,null,null,null,null,null,null,null,"",null,null,null,null,"","","","",""]
[null,null,null,null,null,null,null,null,"",null,null,null,null,"","","","",""]
[null,null,null,null,null,null,null,null,"",null,null,null,null,"","","","",""]
[null,null,null,null,null,null,null,null,"",null,null,null,null,"","","","",""]
[null,null,null,null,null,null,null,null,"",null,null,null,null,"","","","",""]
[null,null,null,null,null,null,null,null,"",null,null,null,null,"","","","",""]
[null,null,null,null,null,null,null,null,"",null,null,null,null,"","","","",""]
[null,null,null,null,null,null,null,null,"",null,null,null,null,"","","","",""]
[null,null,null,null,null,null,null,null,"",null,null,null,null,"","","","",""]
[null,null,null,null,null,null,null,null,"",null,null,null,null,"","","","",""]
[null,null,null,null,null,null,null,null,"",null,null,null,null,"","","","",""]
[null,null,null,null,null,null,null,null,"",null,null,null,null,"","","","",""]
[null,null,null,null,null,null,null,null,"",null,null,null,null,"","","","",""]
[null,null,null,null,null,null,null,null,"",null,null,null,null,"","","","",""]
[null,null,null,null,null,null,null,null,"",null,null,null,null,"","","","",""]
[null,null,null,null,null,null,null,null,"",null,null,null,null,"","","","",""]
[null,null,null,null,null,null,null,null,"",null,null,null,null,"","","","",""]
[null,null,null,null,null,null,null,null,"",null,null,null,null,"","","","",""]
[null,null,null,null,null,null,null,null,"",null,null,null,null,"","","","",""]
[null,null,null,null,null,null,null,null,"",null,null,null,null,"","","","",""]
[null,null,null,null,null,null,null,null,"",null,null,null,null,"","","","",""]
[null,null,null,null,null,null,null,null,"",null,null,null,null,"","","","",""]
[null,null,null,null,null,null,null,null,"",null,null,null,null,"","","","",""]
[null,null,null,null,null,null,null,null,"",null,null,null,null,"","","","",""]
[null,null,null,null,null,null,null,null,"",null,null,null,null,"","","","",""]
[null,null,null,null,null,null,null,null,"",null,null,null,null,"","","","",""]
[null,null,null,null,null,null,null,null,"",null,null,null,null,"","","","",""]
[null,null,null,null,null,null,null,null,"",null,null,null,null,"","","","",""]
[null,null,null,null,null,null,null,null,"",null,null,null,null,"","","","",""]
[null,null,null,null,null,null,null,null,"",null,null,null,null,"","","","",""]
[null,null,null,null,null,null,null,null,"",null,null,null,null,"","","","",""]
[null,null,null,null,null,null,null,null,"",null,null,null,null,"","","","",""]
[null,null,null,null,null,null,null,null,"",null,null,null,null,"","","","",""]
[null,null,null,null,null,null,null,null,"",null,null,null,null,"","","","",""]
[null,null,null,null,null,null,null,null,"",null,null,null,null,"","","","",""]
[null,null,null,null,null,null,null,null,"",null,null,null,null,"","","","",""]
[null,null,null,null,null,null,null,null,"",null,null,null,null,"","","","",""]
[null,null,null,null,null,null,null,null,"",null,null,null,null,"","","","",""]
[null,null,null,null,null,null,null,null,"",null,null,null,null,"","","","",""]
[null,null,null,null,null,null,null,null,"",null,null,null,null,"","","","",""]
[null,null,null,null,null,null,null,null,"",null,null,null,null,"","","","",""]
[null,null,null,null,null,null,null,null,"",null,null,null,null,"","","","",""]
[null,null,null,null,null,null,null,null,"",null,null,null,null,"","","","",""]
[null,null,null,null,null,null,null,null,"",null,null,null,null,"","","","",""]
[null,null,null,null,null,null,null,null,"",null,null,null,null,"","","","",""]
[null,null,null,null,null,null,null,null,"",null,null,null,null,"","","","",""]
[null,null,null,null,null,null,null,null,"",null,null,null,null,"","","","",""]
[null,null,null,null,null,null,null,null,"",null,null,null,null,"","","","",""]
[null,null,null,null,null,null,null,null,"",null,null,null,null,"","","","",""]
[null,null,null,null,null,null,null,null,"",null,null,null,null,"","","","",""]
[null,null,null,null,null,null,null,null,"",null,null,null,null,"","","","",""]
[null,null,null,null,null,null,null,null,"",null,null,null,null,"","","","",""]
[null,null,null,null,null,null,null,null,"",null,null,null,null,"","","","",""]
[null,null,null,null,null,null,null,null,"",null,null,null,null,"","","","",""]
[null,null,null,null,null,null,null,null,"",null,null,null,null,"","","","",""]
[null,null,null,null,null,null,null,null,"",null,null,null,null,"","","","",""]
[null,null,null,null,null,null,null,null,"",null,null,null,null,"","","","",""]
[null,null,null,null,null,null,null,null,"",null,null,null,null,"","","","",""]
[null,null,null,null,null,null,null,null,"",null,null,null,null,"","","","",""]
[null,null,null,null,null,null,null,null,"",null,null,null,null,{"$f":"IF(A904<>\"\",INDEX(Mois_date,MONTH(A904),1),\"\")","v":""},"","","",""]
[null,null,null,null,null,null,null,null,{"$f":"IF(AND(A905<>\"\",YEAR(A905)<>$B$5),\"Erreur date\",\"\")","v":""},null,null,null,null,"",{"$f":"IF(OR(E905<>\"\",F905<>\"\"),E905-F905,\"\")","v":""},{"$f":"IF(AND(D905<>\"\",D905<=TODAY()),\"Perimé\",IF(AND(D905<>\"\",D905<=TODAY()+30),\"Moins d'un mois\",IF(AND(D905<>\"\",D905<=TODAY()+90),\"Moins 3 mois\",IF(AND(D905<>\"\",D905>TODAY()+90),\"Plus 3 mois\",\"\"))))","v":""},{"$f":"IF(OR(N905=\"Janvier\",N905=\"Février\",N905=\"Mars\"),\"Trimestre 1\",IF(OR(N905=\"Avril\",N905=\"Mai\",N905=\"Juin\"),\"Trimestre 2\",IF(OR(N905=\"Juillet\",N905=\"Août\",N905=\"Septembre\"),\"Trimestre 3\",IF(OR(N905=\"Octobre\",N905=\"Novembre\",N905=\"Décembre\"),\"Trimestre 4\",\"\"))))","v":""},{"$f":"IF(OR(Q905=\"Trimestre 1\",Q905=\"Trimestre 2\"),\"Semestre 1\",IF(OR(Q905=\"Trimestre 3\",Q905=\"Trimestre 4\"),\"Semestre 2\",\"\"))","v":""}]
[null,null,null,null,null,null,null,null,"",null,null,null,null,"","","","",""]
[null,null,null,null,null,null,null,null,"",null,null,null,null,"","","","",""]
[null,null,null,null,null,null,null,null,"",null,null,null,null,"","","","",""]
[null,null,null,null,null,null,null,null,"",null,null,null,null,"","","","",""]
[null,null,null,null,null,null,null,null,"",null,null,null,null,"","","","",""]
[null,null,null,null,null,null,null,null,"",null,null,null,null,"","","","",""]
[null,null,null,null,null,null,null,null,"",null,null,null,null,"","","","",""]
[null,null,null,null,null,null,null,null,"",null,null,null,null,"","","","",""]
[null,null,null,null,null,null,null,null,"",null,null,null,null,"","","","",""]
[null,null,null,null,null,null,null,null,"",null,null,null,null,"","","","",""]
[null,null,null,null,null,null,null,null,"",null,null,null,null,"","","","",""]
[null,null,null,null,null,null,null,null,"",null,null,null,null,"","","","",""]
[null,null,null,null,null,null,null,null,"",null,null,null,null,"","","","",""]
[null,null,null,null,null,null,null,null,"",null,null,null,null,"","","","",""]
[null,null,null,null,null,null,null,null,"",null,null,null,null,"","","","",""]
[null,null,null,null,null,null,null,null,"",null,null,null,null,"","","","",""]
[null,null,null,null,null,null,null,null,"",null,null,null,null,"","","","",""]
[null,null,null,null,null,null,null,null,"",null,null,null,null,"","","","",""]
[null,null,null,null,null,null,null,null,"",null,null,null,null,"","","","",""]
[null,null,null,null,null,null,null,null,"",null,null,null,null,"","","","",""]
[null,null,null,null,null,null,null,null,"",null,null,null,null,"","","","",""]
[null,null,null,null,null,null,null,null,"",null,null,null,null,"","","","",""]
[null,null,null,null,null,null,null,null,"",null,null,null,null,"","","","",""]
[null,null,null,null,null,null,null,null,"",null,null,null,null,"","","","",""]
[null,null,null,null,null,null,null,null,"",null,null,null,null,"","","","",""]
[null,null,null,null,null,null,null,null,"",null,null,null,null,"","","","",""]
[null,null,null,null,null,null,null,null,"",null,null,null,null,"","","","",""]
[null,null,null,null,null,null,null,null,"",null,null,null,null,"","","","",""]
[null,null,null,null,null,null,null,null,"",null,null,null,null,"","","","",""]
[null,null,null,null,null,null,null,null,"",null,null,null,null,"","","","",""]
[null,null,null,null,null,null,null,null,"",null,null,null,null,"","","","",""]
[null,null,null,null,null,null,null,null,"",null,null,null,null,"","","","",""]
[null,null,null,null,null,null,null,null,"",null,null,null,null,"","","","",""]
[null,null,null,null,null,null,null,null,"",null,null,null,null,"","","","",""]
[null,null,null,null,null,null,null,null,"",null,null,null,null,"","","","",""]
[null,null,null,null,null,null,null,null,"",null,null,null,null,"","","","",""]
[null,null,null,null,null,null,null,null,"",null,null,null,null,"","","","",""]
[null,null,null,null,null,null,null,null,"",null,null,null,null,"","","","",""]
[null,null,null,null,null,null,null,null,"",null,null,null,null,"","","","",""]
[null,null,null,null,null,null,null,null,"",null,null,null,null,"","","","",""]
[null,null,null,null,null,null,null,null,"",null,null,null,null,"","","","",""]
[null,null,null,null,null,null,null,null,"",null,null,null,null,"","","","",""]
[null,null,null,null,null,null,null,null,"",null,null,null,null,"","","","",""]
[null,null,null,null,null,null,null,null,"",null,null,null,null,"","","","",""]
[null,null,null,null,null,null,null,null,"",null,null,null,null,"","","","",""]
[null,null,null,null,null,null,null,null,"",null,null,null,null,"","","","",""]
[null,null,null,null,null,null,null,null,"",null,null,null,null,"","","","",""]
[null,null,null,null,null,null,null,null,"",null,null,null,null,"","","","",""]
[null,null,null,null,null,null,null,null,"",null,null,null,null,"","","","",""]
[null,null,null,null,null,null,null,null,"",null,null,null,null,"","","","",""]
[null,null,null,null,null,null,null,null,"",null,null,null,null,"","","","",""]
[null,null,null,null,null,null,null,null,"",null,null,null,null,"","","","",""]
[null,null,null,null,null,null,null,null,"",null,null,null,null,"","","","",""]
[null,null,null,null,null,null,null,null,"",null,null,null,null,"","","","",""]
[null,null,null,null,null,null,null,null,"",null,null,null,null,"","","","",""]
[null,null,null,null,null,null,null,null,"",null,null,null,null,"","","","",""]
[null,null,null,null,null,null,null,null,"",null,null,null,null,"","","","",""]
[null,null,null,null,null,null,null,null,"",null,null,null,null,"","","","",""]
[null,null,null,null,null,null,null,null,"",null,null,null,null,"","","","",""]
[null,null,null,null,null,null,null,null,"",null,null,null,null,"","","","",""]
[null,null,null,null,null,null,null,null,"",null,null,null,null,"","","","",""]
[null,null,null,null,null,null,null,null,"",null,null,null,null,"","","","",""]
[null,null,null,null,null,null,null,null,"",null,null,null,null,{"$f":"IF(A968<>\"\",INDEX(Mois_date,MONTH(A968),1),\"\")","v":""},"","","",""]
[null,null,null,null,null,null,null,null,{"$f":"IF(AND(A969<>\"\",YEAR(A969)<>$B$5),\"Erreur date\",\"\")","v":""},null,null,null,null,"",{"$f":"IF(OR(E969<>\"\",F969<>\"\"),E969-F969,\"\")","v":""},{"$f":"IF(AND(D969<>\"\",D969<=TODAY()),\"Perimé\",IF(AND(D969<>\"\",D969<=TODAY()+30),\"Moins d'un mois\",IF(AND(D969<>\"\",D969<=TODAY()+90),\"Moins 3 mois\",IF(AND(D969<>\"\",D969>TODAY()+90),\"Plus 3 mois\",\"\"))))","v":""},{"$f":"IF(OR(N969=\"Janvier\",N969=\"Février\",N969=\"Mars\"),\"Trimestre 1\",IF(OR(N969=\"Avril\",N969=\"Mai\",N969=\"Juin\"),\"Trimestre 2\",IF(OR(N969=\"Juillet\",N969=\"Août\",N969=\"Septembre\"),\"Trimestre 3\",IF(OR(N969=\"Octobre\",N969=\"Novembre\",N969=\"Décembre\"),\"Trimestre 4\",\"\"))))","v":""},{"$f":"IF(OR(Q969=\"Trimestre 1\",Q969=\"Trimestre 2\"),\"Semestre 1\",IF(OR(Q969=\"Trimestre 3\",Q969=\"Trimestre 4\"),\"Semestre 2\",\"\"))","v":""}]
[null,null,null,null,null,null,null,null,"",null,null,null,null,"","","","",""]
[null,null,null,null,null,null,null,null,"",null,null,null,null,"","","","",""]
[null,null,null,null,null,null,null,null,"",null,null,null,null,"","","","",""]
[null,null,null,null,null,null,null,null,"",null,null,null,null,"","","","",""]
[null,null,null,null,null,null,null,null,"",null,null,null,null,"","","","",""]
[null,null,null,null,null,null,null,null,"",null,null,null,null,"","","","",""]
[null,null,null,null,null,null,null,null,"",null,null,null,null,"","","","",""]
[null,null,null,null,null,null,null,null,"",null,null,null,null,"","","","",""]
[null,null,null,null,null,null,null,null,"",null,null,null,null,"","","","",""]
[null,null,null,null,null,null,null,null,"",null,null,null,null,"","","","",""]
[null,null,null,null,null,null,null,null,"",null,null,null,null,"","","","",""]
[null,null,null,null,null,null,null,null,"",null,null,null,null,"","","","",""]
[null,null,null,null,null,null,null,null,"",null,null,null,null,"","","","",""]
[null,null,null,null,null,null,null,null,"",null,null,null,null,"","","","",""]
[null,null,null,null,null,null,null,null,"",null,null,null,null,"","","","",""]
[null,null,null,null,null,null,null,null,"",null,null,null,null,"","","","",""]
[null,null,null,null,null,null,null,null,"",null,null,null,null,"","","","",""]
[null,null,null,null,null,null,null,null,"",null,null,null,null,"","","","",""]
[null,null,null,null,null,null,null,null,"",null,null,null,null,"","","","",""]
[null,null,null,null,null,null,null,null,"",null,null,null,null,"","","","",""]
[null,null,null,null,null,null,null,null,"",null,null,null,null,"","","","",""]
[null,null,null,null,null,null,null,null,"",null,null,null,null,"","","","",""]
[null,null,null,null,null,null,null,null,"",null,null,null,null,"","","","",""]
[null,null,null,null,null,null,null,null,"",null,null,null,null,"","","","",""]
[null,null,null,null,null,null,null,null,"",null,null,null,null,"","","","",""]
[null,null,null,null,null,null,null,null,"",null,null,null,null,"","","","",""]
[null,null,null,null,null,null,null,null,"",null,null,null,null,"","","","",""]
[null,null,null,null,null,null,null,null,"",null,null,null,null,"","","","",""]
[null,null,null,null,null,null,null,null,"",null,null,null,null,"","","","",""]
[null,null,null,null,null,null,null,null,"",null,null,null,null,"","","","",""]
[null,null,null,null,null,null,null,null,"",null,null,null,null,"","","","",""]
[null,null,null,null,null,null,null,null,"",null,null,null,null,"","","","",""]
[null,null,null,null,null,null,null,null,"",null,null,null,null,"","","","",""]
[null,null,null,null,null,null,null,null,"",null,null,null,null,"","","","",""]
[null,null,null,null,null,null,null,null,"",null,null,null,null,"","","","",""]
[null,null,null,null,null,null,null,null,"",null,null,null,null,"","","","",""]
[null,null,null,null,null,null,null,null,"",null,null,null,null,"","","","",""]
[null,null,null,null,null,null,null,null,"",null,null,null,null,"","","","",""]
[null,null,null,null,null,null,null,null,"",null,null,null,null,"","","","",""]
[null,null,null,null,null,null,null,null,"",null,null,null,null,"","","","",""]
[null,null,null,null,null,null,null,null,"",null,null,null,null,"","","","",""]
[null,null,null,null,null,null,null,null,"",null,null,null,null,"","","","",""]
[null,null,null,null,null,null,null,null,"",null,null,null,null,"","","","",""]
[null,null,null,null,null,null,null,null,"",null,null,null,null,"","","","",""]
[null,null,null,null,null,null,null,null,"",null,null,null,null,"","","","",""]
[null,null,null,null,null,null,null,null,"",null,null,null,null,"","","","",""]
[null,null,null,null,null,null,null,null,"",null,null,null,null,"","","","",""]
[null,null,null,null,null,null,null,null,"",null,null,null,null,"","","","",""]
[null,null,null,null,null,null,null,null,"",null,null,null,null,"","","","",""]
[null,null,null,null,null,null,null,null,"",null,null,null,null,"","","","",""]
[null,null,null,null,null,null,null,null,"",null,null,null,null,"","","","",""]
[null,null,null,null,null,null,null,null,"",null,null,null,null,"","","","",""]
[null,null,null,null,null,null,null,null,"",null,null,null,null,"","","","",""]
[null,null,null,null,null,null,null,null,"",null,null,null,null,"","","","",""]
[null,null,null,null,null,null,null,null,"",null,null,null,null,"","","","",""]
[null,null,null,null,null,null,null,null,"",null,null,null,null,"","","","",""]
[null,null,null,null,null,null,null,null,"",null,null,null,null,"","","","",""]
[null,null,null,null,null,null,null,null,"",null,null,null,null,"","","","",""]
[null,null,null,null,null,null,null,null,"",null,null,null,null,"","","","",""]
[null,null,null,null,null,null,null,null,"",null,null,null,null,"","","","",""]
[null,null,null,null,null,null,null,null,"",null,null,null,null,"","","","",""]
[null,null,null,null,null,null,null,null,"",null,null,null,null,"","","","",""]
[null,null,null,null,null,null,null,null,"",null,null,null,null,{"$f":"IF(A1032<>\"\",INDEX(Mois_date,MONTH(A1032),1),\"\")","v":""},"","","",""]
[null,null,null,null,null,null,null,null,{"$f":"IF(AND(A1033<>\"\",YEAR(A1033)<>$B$5),\"Erreur date\",\"\")","v":""},null,null,null,null,"",{"$f":"IF(OR(E1033<>\"\",F1033<>\"\"),E1033-F1033,\"\")","v":""},{"$f":"IF(AND(D1033<>\"\",D1033<=TODAY()),\"Perimé\",IF(AND(D1033<>\"\",D1033<=TODAY()+30),\"Moins d'un mois\",IF(AND(D1033<>\"\",D1033<=TODAY()+90),\"Moins 3 mois\",IF(AND(D1033<>\"\",D1033>TODAY()+90),\"Plus 3 mois\",\"\"))))","v":""},{"$f":"IF(OR(N1033=\"Janvier\",N1033=\"Février\",N1033=\"Mars\"),\"Trimestre 1\",IF(OR(N1033=\"Avril\",N1033=\"Mai\",N1033=\"Juin\"),\"Trimestre 2\",IF(OR(N1033=\"Juillet\",N1033=\"Août\",N1033=\"Septembre\"),\"Trimestre 3\",IF(OR(N1033=\"Octobre\",N1033=\"Novembre\",N1033=\"Décembre\"),\"Trimestre 4\",\"\"))))","v":""},{"$f":"IF(OR(Q1033=\"Trimestre 1\",Q1033=\"Trimestre 2\"),\"Semestre 1\",IF(OR(Q1033=\"Trimestre 3\",Q1033=\"Trimestre 4\"),\"Semestre 2\",\"\"))","v":""}]
[null,null,null,null,null,null,null,null,"",null,null,null,null,"","","","",""]
[null,null,null,null,null,null,null,null,"",null,null,null,null,"","","","",""]
[null,null,null,null,null,null,null,null,"",null,null,null,null,"","","","",""]
[null,null,null,null,null,null,null,null,"",null,null,null,null,"","","","",""]
[null,null,null,null,null,null,null,null,"",null,null,null,null,"","","","",""]
[null,null,null,null,null,null,null,null,"",null,null,null,null,"","","","",""]
[null,null,null,null,null,null,null,null,"",null,null,null,null,"","","","",""]
[null,null,null,null,null,null,null,null,"",null,null,null,null,"","","","",""]
[null,null,null,null,null,null,null,null,"",null,null,null,null,"","","","",""]
[null,null,null,null,null,null,null,null,"",null,null,null,null,"","","","",""]
[null,null,null,null,null,null,null,null,"",null,null,null,null,"","","","",""]
[null,null,null,null,null,null,null,null,"",null,null,null,null,"","","","",""]
[null,null,null,null,null,null,null,null,"",null,null,null,null,"","","","",""]
[null,null,null,null,null,null,null,null,"",null,null,null,null,"","","","",""]
[null,null,null,null,null,null,null,null,"",null,null,null,null,"","","","",""]
[null,null,null,null,null,null,null,null,"",null,null,null,null,"","","","",""]
[null,null,null,null,null,null,null,null,"",null,null,null,null,"","","","",""]
[null,null,null,null,null,null,null,null,"",null,null,null,null,"","","","",""]
[null,null,null,null,null,null,null,null,"",null,null,null,null,"","","","",""]
[null,null,null,null,null,null,null,null,"",null,null,null,null,"","","","",""]
[null,null,null,null,null,null,null,null,"",null,null,null,null,"","","","",""]
[null,null,null,null,null,null,null,null,"",null,null,null,null,"","","","",""]
[null,null,null,null,null,null,null,null,"",null,null,null,null,"","","","",""]
[null,null,null,null,null,null,null,null,"",null,null,null,null,"","","","",""]
[null,null,null,null,null,null,null,null,"",null,null,null,null,"","","","",""]
[null,null,null,null,null,null,null,null,"",null,null,null,null,"","","","",""]
[null,null,null,null,null,null,null,null,"",null,null,null,null,"","","","",""]
[null,null,null,null,null,null,null,null,"",null,null,null,null,"","","","",""]
[null,null,null,null,null,null,null,null,"",null,null,null,null,"","","","",""]
[null,null,null,null,null,null,null,null,"",null,null,null,null,"","","","",""]
[null,null,null,null,null,null,null,null,"",null,null,null,null,"","","","",""]
[null,null,null,null,null,null,null,null,"",null,null,null,null,"","","","",""]
[null,null,null,null,null,null,null,null,"",null,null,null,null,"","","","",""]
[null,null,null,null,null,null,null,null,"",null,null,null,null,"","","","",""]
[null,null,null,null,null,null,null,null,"",null,null,null,null,"","","","",""]
[null,null,null,null,null,null,null,null,"",null,null,null,null,"","","","",""]
[null,null,null,null,null,null,null,null,"",null,null,null,null,"","","","",""]
[null,null,null,null,null,null,null,null,"",null,null,null,null,"","","","",""]
[null,null,null,null,null,null,null,null,"",null,null,null,null,"","","","",""]
[null,null,null,null,null,null,null,null,"",null,null,null,null,"","","","",""]
[null,null,null,null,null,null,null,null,"",null,null,null,null,"","","","",""]
[null,null,null,null,null,null,null,null,"",null,null,null,null,"","","","",""]
[null,null,null,null,null,null,null,null,"",null,null,null,null,"","","","",""]
[null,null,null,null,null,null,null,null,"",null,null,null,null,"","","","",""]
[null,null,null,null,null,null,null,null,"",null,null,null,null,"","","","",""]
[null,null,null,null,null,null,null,null,"",null,null,null,null,"","","","",""]
[null,null,null,null,null,null,null,null,"",null,null,null,null,"","","","",""]
[null,null,null,null,null,null,null,null,"",null,null,null,null,"","","","",""]
[null,null,null,null,null,null,null,null,"",null,null,null,null,"","","","",""]
[null,null,null,null,null,null,null,null,"",null,null,null,null,"","","","",""]
[null,null,null,null,null,null,null,null,"",null,null,null,null,"","","","",""]
[null,null,null,null,null,null,null,null,"",null,null,null,null,"","","","",""]
[null,null,null,null,null,null,null,null,"",null,null,null,null,"","","","",""]
[null,null,null,null,null,null,null,null,"",null,null,null,null,"","","","",""]
[null,null,null,null,null,null,null,null,"",null,null,null,null,"","","","",""]
[null,null,null,null,null,null,null,null,"",null,null,null,null,"","","","",""]
[null,null,null,null,null,null,null,null,"",null,null,null,null,"","","","",""]
[null,null,null,null,null,null,null,null,"",null,null,null,null,"","","","",""]
[null,null,null,null,null,null,null,null,"",null,null,null,null,"","","","",""]
[null,null,null,null,null,null,null,null,"",null,null,null,null,"","","","",""]
[null,null,null,null,null,null,null,null,"",null,null,null,null,"","","","",""]
[null,null,null,null,null,null,null,null,"",null,null,null,null,"","","","",""]
[null,null,null,null,null,null,null,null,"",null,null,null,null,{"$f":"IF(A1096<>\"\",INDEX(Mois_date,MONTH(A1096),1),\"\")","v":""},"","","",""]
[null,null,null,null,null,null,null,null,{"$f":"IF(AND(A1097<>\"\",YEAR(A1097)<>$B$5),\"Erreur date\",\"\")","v":""},null,null,null,null,"",{"$f":"IF(OR(E1097<>\"\",F1097<>\"\"),E1097-F1097,\"\")","v":""},{"$f":"IF(AND(D1097<>\"\",D1097<=TODAY()),\"Perimé\",IF(AND(D1097<>\"\",D1097<=TODAY()+30),\"Moins d'un mois\",IF(AND(D1097<>\"\",D1097<=TODAY()+90),\"Moins 3 mois\",IF(AND(D1097<>\"\",D1097>TODAY()+90),\"Plus 3 mois\",\"\"))))","v":""},{"$f":"IF(OR(N1097=\"Janvier\",N1097=\"Février\",N1097=\"Mars\"),\"Trimestre 1\",IF(OR(N1097=\"Avril\",N1097=\"Mai\",N1097=\"Juin\"),\"Trimestre 2\",IF(OR(N1097=\"Juillet\",N1097=\"Août\",N1097=\"Septembre\"),\"Trimestre 3\",IF(OR(N1097=\"Octobre\",N1097=\"Novembre\",N1097=\"Décembre\"),\"Trimestre 4\",\"\"))))","v":""},{"$f":"IF(OR(Q1097=\"Trimestre 1\",Q1097=\"Trimestre 2\"),\"Semestre 1\",IF(OR(Q1097=\"Trimestre 3\",Q1097=\"Trimestre 4\"),\"Semestre 2\",\"\"))","v":""}]
[null,null,null,null,null,null,null,null,"",null,null,null,null,"","","","",""]
[null,null,null,null,null,null,null,null,"",null,null,null,null,"","","","",""]
[null,null,null,null,null,null,null,null,"",null,null,null,null,"","","","",""]
[null,null,null,null,null,null,null,null,"",null,null,null,null,"","","","",""]
[null,null,null,null,null,null,null,null,"",null,null,null,null,"","","","",""]
[null,null,null,null,null,null,null,null,"",null,null,null,null,"","","","",""]
[null,null,null,null,null,null,null,null,"",null,null,null,null,"","","","",""]
[null,null,null,null,null,null,null,null,"",null,null,null,null,"","","","",""]
[null,null,null,null,null,null,null,null,"",null,null,null,null,"","","","",""]
[null,null,null,null,null,null,null,null,"",null,null,null,null,"","","","",""]
[null,null,null,null,null,null,null,null,"",null,null,null,null,"","","","",""]
[null,null,null,null,null,null,null,null,"",null,null,null,null,"","","","",""]
[null,null,null,null,null,null,null,null,"",null,null,null,null,"","","","",""]
[null,null,null,null,null,null,null,null,"",null,null,null,null,"","","","",""]
[null,null,null,null,null,null,null,null,"",null,null,null,null,"","","","",""]
[null,null,null,null,null,null,null,null,"",null,null,null,null,"","","","",""]
[null,null,null,null,null,null,null,null,"",null,null,null,null,"","","","",""]
[null,null,null,null,null,null,null,null,"",null,null,null,null,"","","","",""]
[null,null,null,null,null,null,null,null,"",null,null,null,null,"","","","",""]
[null,null,null,null,null,null,null,null,"",null,null,null,null,"","","","",""]
[null,null,null,null,null,null,null,null,"",null,null,null,null,"","","","",""]
[null,null,null,null,null,null,null,null,"",null,null,null,null,"","","","",""]
[null,null,null,null,null,null,null,null,"",null,null,null,null,"","","","",""]
[null,null,null,null,null,null,null,null,"",null,null,null,null,"","","","",""]
[null,null,null,null,null,null,null,null,"",null,null,null,null,"","","","",""]
[null,null,null,null,null,null,null,null,"",null,null,null,null,"","","","",""]
[null,null,null,null,null,null,null,null,"",null,null,null,null,"","","","",""]
[null,null,null,null,null,null,null,null,"",null,null,null,null,"","","","",""]
[null,null,null,null,null,null,null,null,"",null,null,null,null,"","","","",""]
[null,null,null,null,null,null,null,null,"",null,null,null,null,"","","","",""]
[null,null,null,null,null,null,null,null,"",null,null,null,null,"","","","",""]
[null,null,null,null,null,null,null,null,"",null,null,null,null,"","","","",""]
[null,null,null,null,null,null,null,null,"",null,null,null,null,"","","","",""]
[null,null,null,null,null,null,null,null,"",null,null,null,null,"","","","",""]
[null,null,null,null,null,null,null,null,"",null,null,null,null,"","","","",""]
[null,null,null,null,null,null,null,null,"",null,null,null,null,"","","","",""]
[null,null,null,null,null,null,null,null,"",null,null,null,null,"","","","",""]
[null,null,null,null,null,null,null,null,"",null,null,null,null,"","","","",""]
[null,null,null,null,null,null,null,null,"",null,null,null,null,"","","","",""]
[null,null,null,null,null,null,null,null,"",null,null,null,null,"","","","",""]
[null,null,null,null,null,null,null,null,"",null,null,null,null,"","","","",""]
[null,null,null,null,null,null,null,null,"",null,null,null,null,"","","","",""]
[null,null,null,null,null,null,null,null,"",null,null,null,null,"","","","",""]
[null,null,null,null,null,null,null,null,"",null,null,null,null,"","","","",""]
[null,null,null,null,null,null,null,null,"",null,null,null,null,"","","","",""]
[null,null,null,null,null,null,null,null,"",null,null,null,null,"","","","",""]
[null,null,null,null,null,null,null,null,"",null,null,null,null,"","","","",""]
[null,null,null,null,null,null,null,null,"",null,null,null,null,"","","","",""]
[null,null,null,null,null,null,null,null,"",null,null,null,null,"","","","",""]
[null,null,null,null,null,null,null,null,"",null,null,null,null,"","","","",""]
[null,null,null,null,null,null,null,null,"",null,null,null,null,"","","","",""]
[null,null,null,null,null,null,null,null,"",null,null,null,null,"","","","",""]
[null,null,null,null,null,null,null,null,"",null,null,null,null,"","","","",""]
[null,null,null,null,null,null,null,null,"",null,null,null,null,"","","","",""]
[null,null,null,null,null,null,null,null,"",null,null,null,null,"","","","",""]
[null,null,null,null,null,null,null,null,"",null,null,null,null,"","","","",""]
[null,null,null,null,null,null,null,null,"",null,null,null,null,"","","","",""]
[null,null,null,null,null,null,null,null,"",null,null,null,null,"","","","",""]
[null,null,null,null,null,null,null,null,"",null,null,null,null,"","","","",""]
[null,null,null,null,null,null,null,null,"",null,null,null,null,"","","","",""]
[null,null,null,null,null,null,null,null,"",null,null,null,null,"","","","",""]
[null,null,null,null,null,null,null,null,"",null,null,null,null,"","","","",""]
[null,null,null,null,null,null,null,null,"",null,null,null,null,{"$f":"IF(A1160<>\"\",INDEX(Mois_date,MONTH(A1160),1),\"\")","v":""},"","","",""]
[null,null,null,null,null,null,null,null,{"$f":"IF(AND(A1161<>\"\",YEAR(A1161)<>$B$5),\"Erreur date\",\"\")","v":""},null,null,null,null,"",{"$f":"IF(OR(E1161<>\"\",F1161<>\"\"),E1161-F1161,\"\")","v":""},{"$f":"IF(AND(D1161<>\"\",D1161<=TODAY()),\"Perimé\",IF(AND(D1161<>\"\",D1161<=TODAY()+30),\"Moins d'un mois\",IF(AND(D1161<>\"\",D1161<=TODAY()+90),\"Moins 3 mois\",IF(AND(D1161<>\"\",D1161>TODAY()+90),\"Plus 3 mois\",\"\"))))","v":""},{"$f":"IF(OR(N1161=\"Janvier\",N1161=\"Février\",N1161=\"Mars\"),\"Trimestre 1\",IF(OR(N1161=\"Avril\",N1161=\"Mai\",N1161=\"Juin\"),\"Trimestre 2\",IF(OR(N1161=\"Juillet\",N1161=\"Août\",N1161=\"Septembre\"),\"Trimestre 3\",IF(OR(N1161=\"Octobre\",N1161=\"Novembre\",N1161=\"Décembre\"),\"Trimestre 4\",\"\"))))","v":""},{"$f":"IF(OR(Q1161=\"Trimestre 1\",Q1161=\"Trimestre 2\"),\"Semestre 1\",IF(OR(Q1161=\"Trimestre 3\",Q1161=\"Trimestre 4\"),\"Semestre 2\",\"\"))","v":""}]
[null,null,null,null,null,null,null,null,"",null,null,null,null,"","","","",""]
[null,null,null,null,null,null,null,null,"",null,null,null,null,"","","","",""]
[null,null,null,null,null,null,null,null,"",null,null,null,null,"","","","",""]
[null,null,null,null,null,null,null,null,"",null,null,null,null,"","","","",""]
[null,null,null,null,null,null,null,null,"",null,null,null,null,"","","","",""]
[null,null,null,null,null,null,null,null,"",null,null,null,null,"","","","",""]
[null,null,null,null,null,null,null,null,"",null,null,null,null,"","","","",""]
[null,null,null,null,null,null,null,null,"",null,null,null,null,"","","","",""]
[null,null,null,null,null,null,null,null,"",null,null,null,null,"","","","",""]
[null,null,null,null,null,null,null,null,"",null,null,null,null,"","","","",""]
[null,null,null,null,null,null,null,null,"",null,null,null,null,"","","","",""]
[null,null,null,null,null,null,null,null,"",null,null,null,null,"","","","",""]
[null,null,null,null,null,null,null,null,"",null,null,null,null,"","","","",""]
[null,null,null,null,null,null,null,null,"",null,null,null,null,"","","","",""]
[null,null,null,null,null,null,null,null,"",null,null,null,null,"","","","",""]
[null,null,null,null,null,null,null,null,"",null,null,null,null,"","","","",""]
[null,null,null,null,null,null,null,null,"",null,null,null,null,"","","","",""]
[null,null,null,null,null,null,null,null,"",null,null,null,null,"","","","",""]
[null,null,null,null,null,null,null,null,"",null,null,null,null,"","","","",""]
[null,null,null,null,null,null,null,null,"",null,null,null,null,"","","","",""]
[null,null,null,null,null,null,null,null,"",null,null,null,null,"","","","",""]
[null,null,null,null,null,null,null,null,"",null,null,null,null,"","","","",""]
[null,null,null,null,null,null,null,null,"",null,null,null,null,"","","","",""]
[null,null,null,null,null,null,null,null,"",null,null,null,null,"","","","",""]
[null,null,null,null,null,null,null,null,"",null,null,null,null,"","","","",""]
[null,null,null,null,null,null,null,null,"",null,null,null,null,"","","","",""]
[null,null,null,null,null,null,null,null,"",null,null,null,null,"","","","",""]
[null,null,null,null,null,null,null,null,"",null,null,null,null,"","","","",""]
[null,null,null,null,null,null,null,null,"",null,null,null,null,"","","","",""]
[null,null,null,null,null,null,null,null,"",null,null,null,null,"","","","",""]
[null,null,null,null,null,null,null,null,"",null,null,null,null,"","","","",""]
[null,null,null,null,null,null,null,null,"",null,null,null,null,"","","","",""]
[null,null,null,null,null,null,null,null,"",null,null,null,null,"","","","",""]
[null,null,null,null,null,null,null,null,"",null,null,null,null,"","","","",""]
[null,null,null,null,null,null,null,null,"",null,null,null,null,"","","","",""]
[null,null,null,null,null,null,null,null,"",null,null,null,null,"","","","",""]
[null,null,null,null,null,null,null,null,"",null,null,null,null,"","","","",""]
[null,null,null,null,null,null,null,null,"",null,null,null,null,"","","","",""]
[null,null,null,null,null,null,null,null,"",null,null,null,null,"","","","",""]
[null,null,null,null,null,null,null,null,"",null,null,null,null,"","","","",""]
[null,null,null,null,null,null,null,null,"",null,null,null,null,"","","","",""]
[null,null,null,null,null,null,null,null,"",null,null,null,null,"","","","",""]
[null,null,null,null,null,null,null,null,"",null,null,null,null,"","","","",""]
[null,null,null,null,null,null,null,null,"",null,null,null,null,"","","","",""]
[null,null,null,null,null,null,null,null,"",null,null,null,null,"","","","",""]
[null,null,null,null,null,null,null,null,"",null,null,null,null,"","","","",""]
[null,null,null,null,null,null,null,null,"",null,null,null,null,"","","","",""]
[null,null,null,null,null,null,null,null,"",null,null,null,null,"","","","",""]
[null,null,null,null,null,null,null,null,"",null,null,null,null,"","","","",""]
[null,null,null,null,null,null,null,null,"",null,null,null,null,"","","","",""]
[null,null,null,null,null,null,null,null,"",null,null,null,null,"","","","",""]
[null,null,null,null,null,null,null,null,"",null,null,null,null,"","","","",""]
[null,null,null,null,null,null,null,null,"",null,null,null,null,"","","","",""]
[null,null,null,null,null,null,null,null,"",null,null,null,null,"","","","",""]
[null,null,null,null,null,null,null,null,"",null,null,null,null,"","","","",""]
[null,null,null,null,null,null,null,null,"",null,null,null,null,"","","","",""]
[null,null,null,null,null,null,null,null,"",null,null,null,null,"","","","",""]
[null,null,null,null,null,null,null,null,"",null,null,null,null,"","","","",""]
[null,null,null,null,null,null,null,null,"",null,null,null,null,"","","","",""]
[null,null,null,null,null,null,null,null,"",null,null,null,null,"","","","",""]
[null,null,null,null,null,null,null,null,"",null,null,null,null,"","","","",""]
[null,null,null,null,null,null,null,null,"",null,null,null,null,"","","","",""]
[null,null,null,null,null,null,null,null,"",null,null,null,null,{"$f":"IF(A1224<>\"\",INDEX(Mois_date,MONTH(A1224),1),\"\")","v":""},"","","",""]
[null,null,null,null,null,null,null,null,{"$f":"IF(AND(A1225<>\"\",YEAR(A1225)<>$B$5),\"Erreur date\",\"\")","v":""},null,null,null,null,"",{"$f":"IF(OR(E1225<>\"\",F1225<>\"\"),E1225-F1225,\"\")","v":""},{"$f":"IF(AND(D1225<>\"\",D1225<=TODAY()),\"Perimé\",IF(AND(D1225<>\"\",D1225<=TODAY()+30),\"Moins d'un mois\",IF(AND(D1225<>\"\",D1225<=TODAY()+90),\"Moins 3 mois\",IF(AND(D1225<>\"\",D1225>TODAY()+90),\"Plus 3 mois\",\"\"))))","v":""},{"$f":"IF(OR(N1225=\"Janvier\",N1225=\"Février\",N1225=\"Mars\"),\"Trimestre 1\",IF(OR(N1225=\"Avril\",N1225=\"Mai\",N1225=\"Juin\"),\"Trimestre 2\",IF(OR(N1225=\"Juillet\",N1225=\"Août\",N1225=\"Septembre\"),\"Trimestre 3\",IF(OR(N1225=\"Octobre\",N1225=\"Novembre\",N1225=\"Décembre\"),\"Trimestre 4\",\"\"))))","v":""},{"$f":"IF(OR(Q1225=\"Trimestre 1\",Q1225=\"Trimestre 2\"),\"Semestre 1\",IF(OR(Q1225=\"Trimestre 3\",Q1225=\"Trimestre 4\"),\"Semestre 2\",\"\"))","v":""}]
[null,null,null,null,null,null,null,null,"",null,null,null,null,"","","","",""]
[null,null,null,null,null,null,null,null,"",null,null,null,null,"","","","",""]
[null,null,null,null,null,null,null,null,"",null,null,null,null,"","","","",""]
[null,null,null,null,null,null,null,null,"",null,null,null,null,"","","","",""]
[null,null,null,null,null,null,null,null,"",null,null,null,null,"","","","",""]
[null,null,null,null,null,null,null,null,"",null,null,null,null,"","","","",""]
[null,null,null,null,null,null,null,null,"",null,null,null,null,"","","","",""]
[null,null,null,null,null,null,null,null,"",null,null,null,null,"","","","",""]
[null,null,null,null,null,null,null,null,"",null,null,null,null,"","","","",""]
[null,null,null,null,null,null,null,null,"",null,null,null,null,"","","","",""]
[null,null,null,null,null,null,null,null,"",null,null,null,null,"","","","",""]
[null,null,null,null,null,null,null,null,"",null,null,null,null,"","","","",""]
[null,null,null,null,null,null,null,null,"",null,null,null,null,"","","","",""]
[null,null,null,null,null,null,null,null,"",null,null,null,null,"","","","",""]
[null,null,null,null,null,null,null,null,"",null,null,null,null,"","","","",""]
[null,null,null,null,null,null,null,null,"",null,null,null,null,"","","","",""]
[null,null,null,null,null,null,null,null,"",null,null,null,null,"","","","",""]
[null,null,null,null,null,null,null,null,"",null,null,null,null,"","","","",""]
[null,null,null,null,null,null,null,null,"",null,null,null,null,"","","","",""]
[null,null,null,null,null,null,null,null,"",null,null,null,null,"","","","",""]
[null,null,null,null,null,null,null,null,"",null,null,null,null,"","","","",""]
[null,null,null,null,null,null,null,null,"",null,null,null,null,"","","","",""]
[null,null,null,null,null,null,null,null,"",null,null,null,null,"","","","",""]
[null,null,null,null,null,null,null,null,"",null,null,null,null,"","","","",""]
[null,null,null,null,null,null,null,null,"",null,null,null,null,"","","","",""]
[null,null,null,null,null,null,null,null,"",null,null,null,null,"","","","",""]
[null,null,null,null,null,null,null,null,"",null,null,null,null,"","","","",""]
[null,null,null,null,null,null,null,null,"",null,null,null,null,"","","","",""]
[null,null,null,null,null,null,null,null,"",null,null,null,null,"","","","",""]
[null,null,null,null,null,null,null,null,"",null,null,null,null,"","","","",""]
[null,null,null,null,null,null,null,null,"",null,null,null,null,"","","","",""]
[null,null,null,null,null,null,null,null,"",null,null,null,null,"","","","",""]
[null,null,null,null,null,null,null,null,"",null,null,null,null,"","","","",""]
[null,null,null,null,null,null,null,null,"",null,null,null,null,"","","","",""]
[null,null,null,null,null,null,null,null,"",null,null,null,null,"","","","",""]
[null,null,null,null,null,null,null,null,"",null,null,null,null,"","","","",""]
[null,null,null,null,null,null,null,null,"",null,null,null,null,"","","","",""]
[null,null,null,null,null,null,null,null,"",null,null,null,null,"","","","",""]
[null,null,null,null,null,null,null,null,"",null,null,null,null,"","","","",""]
[null,null,null,null,null,null,null,null,"",null,null,null,null,"","","","",""]
[null,null,null,null,null,null,null,null,"",null,null,null,null,"","","","",""]
[null,null,null,null,null,null,null,null,"",null,null,null,null,"","","","",""]
[null,null,null,null,null,null,null,null,"",null,null,null,null,"","","","",""]
[null,null,null,null,null,null,null,null,"",null,null,null,null,"","","","",""]
[null,null,null,null,null,null,null,null,"",null,null,null,null,"","","","",""]
[null,null,null,null,null,null,null,null,"",null,null,null,null,"","","","",""]
[null,null,null,null,null,null,null,null,"",null,null,null,null,"","","","",""]
[null,null,null,null,null,null,null,null,"",null,null,null,null,"","","","",""]
[null,null,null,null,null,null,null,null,"",null,null,null,null,"","","","",""]
[null,null,null,null,null,null,null,null,"",null,null,null,null,"","","","",""]
[null,null,null,null,null,null,null,null,"",null,null,null,null,"","","","",""]
[null,null,null,null,null,null,null,null,"",null,null,null,null,"","","","",""]
[null,null,null,null,null,null,null,null,"",null,null,null,null,"","","","",""]
[null,null,null,null,null,null,null,null,"",null,null,null,null,"","","","",""]
[null,null,null,null,null,null,null,null,"",null,null,null,null,"","","","",""]
[null,null,null,null,null,null,null,null,"",null,null,null,null,"","","","",""]
[null,null,null,null,null,null,null,null,"",null,null,null,null,"","","","",""]
[null,null,null,null,null,null,null,null,"",null,null,null,null,"","","","",""]
[null,null,null,null,null,null,null,null,"",null,null,null,null,"","","","",""]
[null,null,null,null,null,null,null,null,"",null,null,null,null,"","","","",""]
[null,null,null,null,null,null,null,null,"",null,null,null,null,"","","","",""]
[null,null,null,null,null,null,null,null,"",null,null,null,null,"","","","",""]
[null,null,null,null,null,null,null,null,"",null,null,null,null,{"$f":"IF(A1288<>\"\",INDEX(Mois_date,MONTH(A1288),1),\"\")","v":""},"","","",""]
[null,null,null,null,null,null,null,null,{"$f":"IF(AND(A1289<>\"\",YEAR(A1289)<>$B$5),\"Erreur date\",\"\")","v":""},null,null,null,null,"",{"$f":"IF(OR(E1289<>\"\",F1289<>\"\"),E1289-F1289,\"\")","v":""},{"$f":"IF(AND(D1289<>\"\",D1289<=TODAY()),\"Perimé\",IF(AND(D1289<>\"\",D1289<=TODAY()+30),\"Moins d'un mois\",IF(AND(D1289<>\"\",D1289<=TODAY()+90),\"Moins 3 mois\",IF(AND(D1289<>\"\",D1289>TODAY()+90),\"Plus 3 mois\",\"\"))))","v":""},{"$f":"IF(OR(N1289=\"Janvier\",N1289=\"Février\",N1289=\"Mars\"),\"Trimestre 1\",IF(OR(N1289=\"Avril\",N1289=\"Mai\",N1289=\"Juin\"),\"Trimestre 2\",IF(OR(N1289=\"Juillet\",N1289=\"Août\",N1289=\"Septembre\"),\"Trimestre 3\",IF(OR(N1289=\"Octobre\",N1289=\"Novembre\",N1289=\"Décembre\"),\"Trimestre 4\",\"\"))))","v":""},{"$f":"IF(OR(Q1289=\"Trimestre 1\",Q1289=\"Trimestre 2\"),\"Semestre 1\",IF(OR(Q1289=\"Trimestre 3\",Q1289=\"Trimestre 4\"),\"Semestre 2\",\"\"))","v":""}]
[null,null,null,null,null,null,null,null,"",null,null,null,null,"","","","",""]
[null,null,null,null,null,null,null,null,"",null,null,null,null,"","","","",""]
[null,null,null,null,null,null,null,null,"",null,null,null,null,"","","","",""]
[null,null,null,null,null,null,null,null,"",null,null,null,null,"","","","",""]
[null,null,null,null,null,null,null,null,"",null,null,null,null,"","","","",""]
[null,null,null,null,null,null,null,null,"",null,null,null,null,"","","","",""]
[null,null,null,null,null,null,null,null,"",null,null,null,null,"","","","",""]
[null,null,null,null,null,null,null,null,"",null,null,null,null,"","","","",""]
[null,null,null,null,null,null,null,null,"",null,null,null,null,"","","","",""]
[null,null,null,null,null,null,null,null,"",null,null,null,null,"","","","",""]
[null,null,null,null,null,null,null,null,"",null,null,null,null,"","","","",""]
[null,null,null,null,null,null,null,null,"",null,null,null,null,"","","","",""]
[null,null,null,null,null,null,null,null,"",null,null,null,null,"","","","",""]
[null,null,null,null,null,null,null,null,"",null,null,null,null,"","","","",""]
[null,null,null,null,null,null,null,null,"",null,null,null,null,"","","","",""]
[null,null,null,null,null,null,null,null,"",null,null,null,null,"","","","",""]
[null,null,null,null,null,null,null,null,"",null,null,null,null,"","","","",""]
[null,null,null,null,null,null,null,null,"",null,null,null,null,"","","","",""]
[null,null,null,null,null,null,null,null,"",null,null,null,null,"","","","",""]
[null,null,null,null,null,null,null,null,"",null,null,null,null,"","","","",""]
[null,null,null,null,null,null,null,null,"",null,null,null,null,"","","","",""]
[null,null,null,null,null,null,null,null,"",null,null,null,null,"","","","",""]
[null,null,null,null,null,null,null,null,"",null,null,null,null,"","","","",""]
[null,null,null,null,null,null,null,null,"",null,null,null,null,"","","","",""]
[null,null,null,null,null,null,null,null,"",null,null,null,null,"","","","",""]
[null,null,null,null,null,null,null,null,"",null,null,null,null,"","","","",""]
[null,null,null,null,null,null,null,null,"",null,null,null,null,"","","","",""]
[null,null,null,null,null,null,null,null,"",null,null,null,null,"","","","",""]
[null,null,null,null,null,null,null,null,"",null,null,null,null,"","","","",""]
[null,null,null,null,null,null,null,null,"",null,null,null,null,"","","","",""]
[null,null,null,null,null,null,null,null,"",null,null,null,null,"","","","",""]
[null,null,null,null,null,null,null,null,"",null,null,null,null,"","","","",""]
[null,null,null,null,null,null,null,null,"",null,null,null,null,"","","","",""]
[null,null,null,null,null,null,null,null,"",null,null,null,null,"","","","",""]
[null,null,null,null,null,null,null,null,"",null,null,null,null,"","","","",""]
[null,null,null,null,null,null,null,null,"",null,null,null,null,"","","","",""]
[null,null,null,null,null,null,null,null,"",null,null,null,null,"","","","",""]
[null,null,null,null,null,null,null,null,"",null,null,null,null,"","","","",""]
[null,null,null,null,null,null,null,null,"",null,null,null,null,"","","","",""]
[null,null,null,null,null,null,null,null,"",null,null,null,null,"","","","",""]
[null,null,null,null,null,null,null,null,"",null,null,null,null,"","","","",""]
[null,null,null,null,null,null,null,null,"",null,null,null,null,"","","","",""]
[null,null,null,null,null,null,null,null,"",null,null,null,null,"","","","",""]
[null,null,null,null,null,null,null,null,"",null,null,null,null,"","","","",""]
[null,null,null,null,null,null,null,null,"",null,null,null,null,"","","","",""]
[null,null,null,null,null,null,null,null,"",null,null,null,null,"","","","",""]
[null,null,null,null,null,null,null,null,"",null,null,null,null,"","","","",""]
[null,null,null,null,null,null,null,null,"",null,null,null,null,"","","","",""]
[null,null,null,null,null,null,null,null,"",null,null,null,null,"","","","",""]
[null,null,null,null,null,null,null,null,"",null,null,null,null,"","","","",""]
[null,null,null,null,null,null,null,null,"",null,null,null,null,"","","","",""]
[null,null,null,null,null,null,null,null,"",null,null,null,null,"","","","",""]
[null,null,null,null,null,null,null,null,"",null,null,null,null,"","","","",""]
[null,null,null,null,null,null,null,null,"",null,null,null,null,"","","","",""]
[null,null,null,null,null,null,null,null,"",null,null,null,null,"","","","",""]
[null,null,null,null,null,null,null,null,"",null,null,null,null,"","","","",""]
[null,null,null,null,null,null,null,null,"",null,null,null,null,"","","","",""]
[null,null,null,null,null,null,null,null,"",null,null,null,null,"","","","",""]
[null,null,null,null,null,null,null,null,"",null,null,null,null,"","","","",""]
[null,null,null,null,null,null,null,null,"",null,null,null,null,"","","","",""]
[null,null,null,null,null,null,null,null,"",null,null,null,null,"","","","",""]
[null,null,null,null,null,null,null,null,"",null,null,null,null,"","","","",""]
[null,null,null,null,null,null,null,null,"",null,null,null,null,{"$f":"IF(A1352<>\"\",INDEX(Mois_date,MONTH(A1352),1),\"\")","v":""},"","","",""]
[null,null,null,null,null,null,null,null,{"$f":"IF(AND(A1353<>\"\",YEAR(A1353)<>$B$5),\"Erreur date\",\"\")","v":""},null,null,null,null,"",{"$f":"IF(OR(E1353<>\"\",F1353<>\"\"),E1353-F1353,\"\")","v":""},{"$f":"IF(AND(D1353<>\"\",D1353<=TODAY()),\"Perimé\",IF(AND(D1353<>\"\",D1353<=TODAY()+30),\"Moins d'un mois\",IF(AND(D1353<>\"\",D1353<=TODAY()+90),\"Moins 3 mois\",IF(AND(D1353<>\"\",D1353>TODAY()+90),\"Plus 3 mois\",\"\"))))","v":""},{"$f":"IF(OR(N1353=\"Janvier\",N1353=\"Février\",N1353=\"Mars\"),\"Trimestre 1\",IF(OR(N1353=\"Avril\",N1353=\"Mai\",N1353=\"Juin\"),\"Trimestre 2\",IF(OR(N1353=\"Juillet\",N1353=\"Août\",N1353=\"Septembre\"),\"Trimestre 3\",IF(OR(N1353=\"Octobre\",N1353=\"Novembre\",N1353=\"Décembre\"),\"Trimestre 4\",\"\"))))","v":""},{"$f":"IF(OR(Q1353=\"Trimestre 1\",Q1353=\"Trimestre 2\"),\"Semestre 1\",IF(OR(Q1353=\"Trimestre 3\",Q1353=\"Trimestre 4\"),\"Semestre 2\",\"\"))","v":""}]
[null,null,null,null,null,null,null,null,"",null,null,null,null,"","","","",""]
[null,null,null,null,null,null,null,null,"",null,null,null,null,"","","","",""]
[null,null,null,null,null,null,null,null,"",null,null,null,null,"","","","",""]
[null,null,null,null,null,null,null,null,"",null,null,null,null,"","","","",""]
[null,null,null,null,null,null,null,null,"",null,null,null,null,"","","","",""]
[null,null,null,null,null,null,null,null,"",null,null,null,null,"","","","",""]
[null,null,null,null,null,null,null,null,"",null,null,null,null,"","","","",""]
[null,null,null,null,null,null,null,null,"",null,null,null,null,"","","","",""]
[null,null,null,null,null,null,null,null,"",null,null,null,null,"","","","",""]
[null,null,null,null,null,null,null,null,"",null,null,null,null,"","","","",""]
[null,null,null,null,null,null,null,null,"",null,null,null,null,"","","","",""]
[null,null,null,null,null,null,null,null,"",null,null,null,null,"","","","",""]
[null,null,null,null,null,null,null,null,"",null,null,null,null,"","","","",""]
[null,null,null,null,null,null,null,null,"",null,null,null,null,"","","","",""]
[null,null,null,null,null,null,null,null,"",null,null,null,null,"","","","",""]
[null,null,null,null,null,null,null,null,"",null,null,null,null,"","","","",""]
[null,null,null,null,null,null,null,null,"",null,null,null,null,"","","","",""]
[null,null,null,null,null,null,null,null,"",null,null,null,null,"","","","",""]
[null,null,null,null,null,null,null,null,"",null,null,null,null,"","","","",""]
[null,null,null,null,null,null,null,null,"",null,null,null,null,"","","","",""]
[null,null,null,null,null,null,null,null,"",null,null,null,null,"","","","",""]
[null,null,null,null,null,null,null,null,"",null,null,null,null,"","","","",""]
[null,null,null,null,null,null,null,null,"",null,null,null,null,"","","","",""]
[null,null,null,null,null,null,null,null,"",null,null,null,null,"","","","",""]
[null,null,null,null,null,null,null,null,"",null,null,null,null,"","","","",""]
[null,null,null,null,null,null,null,null,"",null,null,null,null,"","","","",""]
[null,null,null,null,null,null,null,null,"",null,null,null,null,"","","","",""]
[null,null,null,null,null,null,null,null,"",null,null,null,null,"","","","",""]
[null,null,null,null,null,null,null,null,"",null,null,null,null,"","","","",""]
[null,null,null,null,null,null,null,null,"",null,null,null,null,"","","","",""]
[null,null,null,null,null,null,null,null,"",null,null,null,null,"","","","",""]
[null,null,null,null,null,null,null,null,"",null,null,null,null,"","","","",""]
[null,null,null,null,null,null,null,null,"",null,null,null,null,"","","","",""]
[null,null,null,null,null,null,null,null,"",null,null,null,null,"","","","",""]
[null,null,null,null,null,null,null,null,"",null,null,null,null,"","","","",""]
[null,null,null,null,null,null,null,null,"",null,null,null,null,"","","","",""]
[null,null,null,null,null,null,null,null,"",null,null,null,null,"","","","",""]
[null,null,null,null,null,null,null,null,"",null,null,null,null,"","","","",""]
[null,null,null,null,null,null,null,null,"",null,null,null,null,"","","","",""]
[null,null,null,null,null,null,null,null,"",null,null,null,null,"","","","",""]
[null,null,null,null,null,null,null,null,"",null,null,null,null,"","","","",""]
[null,null,null,null,null,null,null,null,"",null,null,null,null,"","","","",""]
[null,null,null,null,null,null,null,null,"",null,null,null,null,"","","","",""]
[null,null,null,null,null,null,null,null,"",null,null,null,null,"","","","",""]
[null,null,null,null,null,null,null,null,"",null,null,null,null,"","","","",""]
[null,null,null,null,null,null,null,null,"",null,null,null,null,"","","","",""]
[null,null,null,null,null,null,null,null,"",null,null,null,null,"","","","",""]
[null,null,null,null,null,null,null,null,"",null,null,null,null,"","","","",""]
[null,null,null,null,null,null,null,null,"",null,null,null,null,"","","","",""]
[null,null,null,null,null,null,null,null,"",null,null,null,null,"","","","",""]
[null,null,null,null,null,null,null,null,"",null,null,null,null,"","","","",""]
[null,null,null,null,null,null,null,null,"",null,null,null,null,"","","","",""]
[null,null,null,null,null,null,null,null,"",null,null,null,null,"","","","",""]
[null,null,null,null,null,null,null,null,"",null,null,null,null,"","","","",""]
[null,null,null,null,null,null,null,null,"",null,null,null,null,"","","","",""]
[null,null,null,null,null,null,null,null,"",null,null,null,null,"","","","",""]
[null,null,null,null,null,null,null,null,"",null,null,null,null,"","","","",""]
[null,null,null,null,null,null,null,null,"",null,null,null,null,"","","","",""]
[null,null,null,null,null,null,null,null,"",null,null,null,null,"","","","",""]
[null,null,null,null,null,null,null,null,"",null,null,null,null,"","","","",""]
[null,null,null,null,null,null,null,null,"",null,null,null,null,"","","","",""]
[null,null,null,null,null,null,null,null,"",null,null,null,null,"","","","",""]
[null,null,null,null,null,null,null,null,"",null,null,null,null,{"$f":"IF(A1416<>\"\",INDEX(Mois_date,MONTH(A1416),1),\"\")","v":""},"","","",""]
[null,null,null,null,null,null,null,null,{"$f":"IF(AND(A1417<>\"\",YEAR(A1417)<>$B$5),\"Erreur date\",\"\")","v":""},null,null,null,null,"",{"$f":"IF(OR(E1417<>\"\",F1417<>\"\"),E1417-F1417,\"\")","v":""},{"$f":"IF(AND(D1417<>\"\",D1417<=TODAY()),\"Perimé\",IF(AND(D1417<>\"\",D1417<=TODAY()+30),\"Moins d'un mois\",IF(AND(D1417<>\"\",D1417<=TODAY()+90),\"Moins 3 mois\",IF(AND(D1417<>\"\",D1417>TODAY()+90),\"Plus 3 mois\",\"\"))))","v":""},{"$f":"IF(OR(N1417=\"Janvier\",N1417=\"Février\",N1417=\"Mars\"),\"Trimestre 1\",IF(OR(N1417=\"Avril\",N1417=\"Mai\",N1417=\"Juin\"),\"Trimestre 2\",IF(OR(N1417=\"Juillet\",N1417=\"Août\",N1417=\"Septembre\"),\"Trimestre 3\",IF(OR(N1417=\"Octobre\",N1417=\"Novembre\",N1417=\"Décembre\"),\"Trimestre 4\",\"\"))))","v":""},{"$f":"IF(OR(Q1417=\"Trimestre 1\",Q1417=\"Trimestre 2\"),\"Semestre 1\",IF(OR(Q1417=\"Trimestre 3\",Q1417=\"Trimestre 4\"),\"Semestre 2\",\"\"))","v":""}]
[null,null,null,null,null,null,null,null,"",null,null,null,null,"","","","",""]
[null,null,null,null,null,null,null,null,"",null,null,null,null,"","","","",""]
[null,null,null,null,null,null,null,null,"",null,null,null,null,"","","","",""]
[null,null,null,null,null,null,null,null,"",null,null,null,null,"","","","",""]
[null,null,null,null,null,null,null,null,"",null,null,null,null,"","","","",""]
[null,null,null,null,null,null,null,null,"",null,null,null,null,"","","","",""]
[null,null,null,null,null,null,null,null,"",null,null,null,null,"","","","",""]
[null,null,null,null,null,null,null,null,"",null,null,null,null,"","","","",""]
[null,null,null,null,null,null,null,null,"",null,null,null,null,"","","","",""]
[null,null,null,null,null,null,null,null,"",null,null,null,null,"","","","",""]
[null,null,null,null,null,null,null,null,"",null,null,null,null,"","","","",""]
[null,null,null,null,null,null,null,null,"",null,null,null,null,"","","","",""]
[null,null,null,null,null,null,null,null,"",null,null,null,null,"","","","",""]
[null,null,null,null,null,null,null,null,"",null,null,null,null,"","","","",""]
[null,null,null,null,null,null,null,null,"",null,null,null,null,"","","","",""]
[null,null,null,null,null,null,null,null,"",null,null,null,null,"","","","",""]
[null,null,null,null,null,null,null,null,"",null,null,null,null,"","","","",""]
[null,null,null,null,null,null,null,null,"",null,null,null,null,"","","","",""]
[null,null,null,null,null,null,null,null,"",null,null,null,null,"","","","",""]
[null,null,null,null,null,null,null,null,"",null,null,null,null,"","","","",""]
[null,null,null,null,null,null,null,null,"",null,null,null,null,"","","","",""]
[null,null,null,null,null,null,null,null,"",null,null,null,null,"","","","",""]
[null,null,null,null,null,null,null,null,"",null,null,null,null,"","","","",""]
[null,null,null,null,null,null,null,null,"",null,null,null,null,"","","","",""]
[null,null,null,null,null,null,null,null,"",null,null,null,null,"","","","",""]
[null,null,null,null,null,null,null,null,"",null,null,null,null,"","","","",""]
[null,null,null,null,null,null,null,null,"",null,null,null,null,"","","","",""]
[null,null,null,null,null,null,null,null,"",null,null,null,null,"","","","",""]
[null,null,null,null,null,null,null,null,"",null,null,null,null,"","","","",""]
[null,null,null,null,null,null,null,null,"",null,null,null,null,"","","","",""]
[null,null,null,null,null,null,null,null,"",null,null,null,null,"","","","",""]
[null,null,null,null,null,null,null,null,"",null,null,null,null,"","","","",""]
[null,null,null,null,null,null,null,null,"",null,null,null,null,"","","","",""]
[null,null,null,null,null,null,null,null,"",null,null,null,null,"","","","",""]
[null,null,null,null,null,null,null,null,"",null,null,null,null,"","","","",""]
[null,null,null,null,null,null,null,null,"",null,null,null,null,"","","","",""]
[null,null,null,null,null,null,null,null,"",null,null,null,null,"","","","",""]
[null,null,null,null,null,null,null,null,"",null,null,null,null,"","","","",""]
[null,null,null,null,null,null,null,null,"",null,null,null,null,"","","","",""]
[null,null,null,null,null,null,null,null,"",null,null,null,null,"","","","",""]
[null,null,null,null,null,null,null,null,"",null,null,null,null,"","","","",""]
[null,null,null,null,null,null,null,null,"",null,null,null,null,"","","","",""]
[null,null,null,null,null,null,null,null,"",null,null,null,null,"","","","",""]
[null,null,null,null,null,null,null,null,"",null,null,null,null,"","","","",""]
[null,null,null,null,null,null,null,null,"",null,null,null,null,"","","","",""]
[null,null,null,null,null,null,null,null,"",null,null,null,null,"","","","",""]
[null,null,null,null,null,null,null,null,"",null,null,null,null,"","","","",""]
[null,null,null,null,null,null,null,null,"",null,null,null,null,"","","","",""]
[null,null,null,null,null,null,null,null,"",null,null,null,null,"","","","",""]
[null,null,null,null,null,null,null,null,"",null,null,null,null,"","","","",""]
[null,null,null,null,null,null,null,null,"",null,null,null,null,"","","","",""]
[null,null,null,null,null,null,null,null,"",null,null,null,null,"","","","",""]
[null,null,null,null,null,null,null,null,"",null,null,null,null,"","","","",""]
[null,null,null,null,null,null,null,null,"",null,null,null,null,"","","","",""]
[null,null,null,null,null,null,null,null,"",null,null,null,null,"","","","",""]
[null,null,null,null,null,null,null,null,"",null,null,null,null,"","","","",""]
[null,null,null,null,null,null,null,null,"",null,null,null,null,"","","","",""]
[null,null,null,null,null,null,null,null,"",null,null,null,null,"","","","",""]
[null,null,null,null,null,null,null,null,"",null,null,null,null,"","","","",""]
[null,null,null,null,null,null,null,null,"",null,null,null,null,"","","","",""]
[null,null,null,null,null,null,null,null,"",null,null,null,null,"","","","",""]
[null,null,null,null,null,null,null,null,"",null,null,null,null,"","","","",""]
[null,null,null,null,null,null,null,null,"",null,null,null,null,{"$f":"IF(A1480<>\"\",INDEX(Mois_date,MONTH(A1480),1),\"\")","v":""},"","","",""]
[null,null,null,null,null,null,null,null,{"$f":"IF(AND(A1481<>\"\",YEAR(A1481)<>$B$5),\"Erreur date\",\"\")","v":""},null,null,null,null,"",{"$f":"IF(OR(E1481<>\"\",F1481<>\"\"),E1481-F1481,\"\")","v":""},{"$f":"IF(AND(D1481<>\"\",D1481<=TODAY()),\"Perimé\",IF(AND(D1481<>\"\",D1481<=TODAY()+30),\"Moins d'un mois\",IF(AND(D1481<>\"\",D1481<=TODAY()+90),\"Moins 3 mois\",IF(AND(D1481<>\"\",D1481>TODAY()+90),\"Plus 3 mois\",\"\"))))","v":""},{"$f":"IF(OR(N1481=\"Janvier\",N1481=\"Février\",N1481=\"Mars\"),\"Trimestre 1\",IF(OR(N1481=\"Avril\",N1481=\"Mai\",N1481=\"Juin\"),\"Trimestre 2\",IF(OR(N1481=\"Juillet\",N1481=\"Août\",N1481=\"Septembre\"),\"Trimestre 3\",IF(OR(N1481=\"Octobre\",N1481=\"Novembre\",N1481=\"Décembre\"),\"Trimestre 4\",\"\"))))","v":""},{"$f":"IF(OR(Q1481=\"Trimestre 1\",Q1481=\"Trimestre 2\"),\"Semestre 1\",IF(OR(Q1481=\"Trimestre 3\",Q1481=\"Trimestre 4\"),\"Semestre 2\",\"\"))","v":""}]
[null,null,null,null,null,null,null,null,"",null,null,null,null,"","","","",""]
[null,null,null,null,null,null,null,null,"",null,null,null,null,"","","","",""]
[null,null,null,null,null,null,null,null,"",null,null,null,null,"","","","",""]
[null,null,null,null,null,null,null,null,"",null,null,null,null,"","","","",""]
[null,null,null,null,null,null,null,null,"",null,null,null,null,"","","","",""]
[null,null,null,null,null,null,null,null,"",null,null,null,null,"","","","",""]
[null,null,null,null,null,null,null,null,"",null,null,null,null,"","","","",""]
[null,null,null,null,null,null,null,null,"",null,null,null,null,"","","","",""]
[null,null,null,null,null,null,null,null,"",null,null,null,null,"","","","",""]
[null,null,null,null,null,null,null,null,"",null,null,null,null,"","","","",""]
[null,null,null,null,null,null,null,null,"",null,null,null,null,"","","","",""]
[null,null,null,null,null,null,null,null,"",null,null,null,null,"","","","",""]
[null,null,null,null,null,null,null,null,"",null,null,null,null,"","","","",""]
[null,null,null,null,null,null,null,null,"",null,null,null,null,"","","","",""]
[null,null,null,null,null,null,null,null,"",null,null,null,null,"","","","",""]
[null,null,null,null,null,null,null,null,"",null,null,null,null,"","","","",""]
[null,null,null,null,null,null,null,null,"",null,null,null,null,"","","","",""]
[null,null,null,null,null,null,null,null,"",null,null,null,null,"","","","",""]
[null,null,null,null,null,null,null,null,"",null,null,null,null,"","","","",""]

{"sheet":"Etat_stock","index":11,"n_rows":16,"n_cols":8,"rows_kept":16,"cut":false,"hidden":true,"merged":[[7,1,8,1],[7,2,8,2],[7,3,7,6],[7,7,8,7]]}
["Association de Lutte Contre le Sida"]
[]
["Section",{"$f":"IF(Accueil!$D$9<>\"\",Accueil!$D$9,\"\")","v":""},null,"Etat du stock médicaments IST"]
["CIDAG",{"$f":"IF(Accueil!$D$11<>\"\",Accueil!$D$11,\"\")","v":""}]
["Année",{"$f":"IF(Accueil!$D$10<>\"\",Accueil!$D$10,\"\")","v":""},null,"Date",{"$f":"TODAY()","v":"2011-12-20"}]
[]
[]
[null,"Désignation","Stock disponible","Peremptions",null,null,null,"Etat stock"]
[null,null,null,"Plus 3 mois","Moins 3 mois","Moins d'un mois","Perimé"]
[null,"Benz Péni 1,2",{"$f":"SUM(D10:F10)","v":0},{"$f":"SUMIFS(Gestion_Stock!$O$8:$O$1000,Gestion_Stock!$B$8:$B$1000,Etat_stock!$B10,Gestion_Stock!$P$8:$P$1000,Etat_stock!D$9)","v":0},{"$f":"SUMIFS(Gestion_Stock!$O$8:$O$1000,Gestion_Stock!$B$8:$B$1000,Etat_stock!$B10,Gestion_Stock!$P$8:$P$1000,Etat_stock!E$9)","v":0},{"$f":"SUMIFS(Gestion_Stock!$O$8:$O$1000,Gestion_Stock!$B$8:$B$1000,Etat_stock!$B10,Gestion_Stock!$P$8:$P$1000,Etat_stock!F$9)","v":0},{"$f":"SUMIFS(Gestion_Stock!$O$8:$O$1000,Gestion_Stock!$B$8:$B$1000,Etat_stock!$B10,Gestion_Stock!$P$8:$P$1000,Etat_stock!G$9)","v":0},{"$f":"IF(C10<=25,\"Stock insuffisant\",\"\")","v":"Stock insuffisant"}]
[null,"Ceftriaxone",0,{"$f":"SUMIFS(Gestion_Stock!$O$8:$O$1000,Gestion_Stock!$B$8:$B$1000,Etat_stock!$B11,Gestion_Stock!$P$8:$P$1000,Etat_stock!D$9)","v":0},{"$f":"SUMIFS(Gestion_Stock!$O$8:$O$1000,Gestion_Stock!$B$8:$B$1000,Etat_stock!$B11,Gestion_Stock!$P$8:$P$1000,Etat_stock!E$9)","v":0},{"$f":"SUMIFS(Gestion_Stock!$O$8:$O$1000,Gestion_Stock!$B$8:$B$1000,Etat_stock!$B11,Gestion_Stock!$P$8:$P$1000,Etat_stock!F$9)","v":0},{"$f":"SUMIFS(Gestion_Stock!$O$8:$O$1000,Gestion_Stock!$B$8:$B$1000,Etat_stock!$B11,Gestion_Stock!$P$8:$P$1000,Etat_stock!G$9)","v":0},{"$f":"IF(C11<=100,\"Stock insuffisant\",\"\")","v":"Stock insuffisant"}]
[null,"Erythromycine",0,{"$f":"SUMIFS(Gestion_Stock!$O$8:$O$1000,Gestion_Stock!$B$8:$B$1000,Etat_stock!$B12,Gestion_Stock!$P$8:$P$1000,Etat_stock!D$9)","v":0},{"$f":"SUMIFS(Gestion_Stock!$O$8:$O$1000,Gestion_Stock!$B$8:$B$1000,Etat_stock!$B12,Gestion_Stock!$P$8:$P$1000,Etat_stock!E$9)","v":0},{"$f":"SUMIFS(Gestion_Stock!$O$8:$O$1000,Gestion_Stock!$B$8:$B$1000,Etat_stock!$B12,Gestion_Stock!$P$8:$P$1000,Etat_stock!F$9)","v":0},{"$f":"SUMIFS(Gestion_Stock!$O$8:$O$1000,Gestion_Stock!$B$8:$B$1000,Etat_stock!$B12,Gestion_Stock!$P$8:$P$1000,Etat_stock!G$9)","v":0},"Stock insuffisant"]
[null,"Doxicycline",0,{"$f":"SUMIFS(Gestion_Stock!$O$8:$O$1000,Gestion_Stock!$B$8:$B$1000,Etat_stock!$B13,Gestion_Stock!$P$8:$P$1000,Etat_stock!D$9)","v":0},{"$f":"SUMIFS(Gestion_Stock!$O$8:$O$1000,Gestion_Stock!$B$8:$B$1000,Etat_stock!$B13,Gestion_Stock!$P$8:$P$1000,Etat_stock!E$9)","v":0},{"$f":"SUMIFS(Gestion_Stock!$O$8:$O$1000,Gestion_Stock!$B$8:$B$1000,Etat_stock!$B13,Gestion_Stock!$P$8:$P$1000,Etat_stock!F$9)","v":0},{"$f":"SUMIFS(Gestion_Stock!$O$8:$O$1000,Gestion_Stock!$B$8:$B$1000,Etat_stock!$B13,Gestion_Stock!$P$8:$P$1000,Etat_stock!G$9)","v":0},"Stock insuffisant"]
[null,"Econazol",0,{"$f":"SUMIFS(Gestion_Stock!$O$8:$O$1000,Gestion_Stock!$B$8:$B$1000,Etat_stock!$B14,Gestion_Stock!$P$8:$P$1000,Etat_stock!D$9)","v":0},{"$f":"SUMIFS(Gestion_Stock!$O$8:$O$1000,Gestion_Stock!$B$8:$B$1000,Etat_stock!$B14,Gestion_Stock!$P$8:$P$1000,Etat_stock!E$9)","v":0},{"$f":"SUMIFS(Gestion_Stock!$O$8:$O$1000,Gestion_Stock!$B$8:$B$1000,Etat_stock!$B14,Gestion_Stock!$P$8:$P$1000,Etat_stock!F$9)","v":0},{"$f":"SUMIFS(Gestion_Stock!$O$8:$O$1000,Gestion_Stock!$B$8:$B$1000,Etat_stock!$B14,Gestion_Stock!$P$8:$P$1000,Etat_stock!G$9)","v":0},"Stock insuffisant"]
[null,"Métronidazol",0,{"$f":"SUMIFS(Gestion_Stock!$O$8:$O$1000,Gestion_Stock!$B$8:$B$1000,Etat_stock!$B15,Gestion_Stock!$P$8:$P$1000,Etat_stock!D$9)","v":0},{"$f":"SUMIFS(Gestion_Stock!$O$8:$O$1000,Gestion_Stock!$B$8:$B$1000,Etat_stock!$B15,Gestion_Stock!$P$8:$P$1000,Etat_stock!E$9)","v":0},{"$f":"SUMIFS(Gestion_Stock!$O$8:$O$1000,Gestion_Stock!$B$8:$B$1000,Etat_stock!$B15,Gestion_Stock!$P$8:$P$1000,Etat_stock!F$9)","v":0},{"$f":"SUMIFS(Gestion_Stock!$O$8:$O$1000,Gestion_Stock!$B$8:$B$1000,Etat_stock!$B15,Gestion_Stock!$P$8:$P$1000,Etat_stock!G$9)","v":0},"Stock insuffisant"]
[null,"Ciprofloxacine",0,{"$f":"SUMIFS(Gestion_Stock!$O$8:$O$1000,Gestion_Stock!$B$8:$B$1000,Etat_stock!$B16,Gestion_Stock!$P$8:$P$1000,Etat_stock!D$9)","v":0},{"$f":"SUMIFS(Gestion_Stock!$O$8:$O$1000,Gestion_Stock!$B$8:$B$1000,Etat_stock!$B16,Gestion_Stock!$P$8:$P$1000,Etat_stock!E$9)","v":0},{"$f":"SUMIFS(Gestion_Stock!$O$8:$O$1000,Gestion_Stock!$B$8:$B$1000,Etat_stock!$B16,Gestion_Stock!$P$8:$P$1000,Etat_stock!F$9)","v":0},{"$f":"SUMIFS(Gestion_Stock!$O$8:$O$1000,Gestion_Stock!$B$8:$B$1000,Etat_stock!$B16,Gestion_Stock!$P$8:$P$1000,Etat_stock!G$9)","v":0},"Stock insuffisant"]

{"sheet":"Commande_CIDAG","index":12,"n_rows":22,"n_cols":15,"rows_kept":22,"cut":false,"hidden":true,"merged":[[7,9,7,10],[6,6,6,8],[7,1,8,1],[7,2,8,2],[7,3,7,5],[7,6,7,8]]}
["Association de Lutte Contre le Sida"]
[null,null,null,null,null,null,null,null,null,null,null,null,null,null,{"$f":"\"Trimestre\"&+\" \"&+ G3-1","v":"Trimestre 4"}]
["Section",{"$f":"IF(Accueil!$B$9<>\"\",Accueil!$B$9,\"\")","v":"Section"},"Commande médicaments IST trimestre :",null,null,null,5]
["CIDAG",{"$f":"IF(Accueil!$B$11<>\"\",Accueil!$B$11,\"\")","v":"CIDAG"}]
["Année",{"$f":"IF(Accueil!$B$10<>\"\",Accueil!$B$10,\"\")","v":"Année"},null,"Date",{"$f":"TODAY()","v":"2011-12-20"}]
[]
[]
[null,"Désignation","Stock disponible","Délais de peremption des quantites en stock",null,null,{"$f":"O2&\"\"","v":"Trimestre 4"},null,null,"Besoins pour    :",null,{"$f":"\"Trimestre\"&+\" \"&+G3","v":"Trimestre 5"}]
[null,null,null,"Plus 3 mois","Moins 3 mois","Moins d'un mois","Perimé","Utilisé par CIDAG","Utilisé par autre","Besoins CIDAG","Besoins autre","Total"]
[null,"Benz Péni 1,2",{"$f":"SUM(D10:F10)","v":0},{"$f":"SUMIFS(Gestion_Stock!$O$8:$O$1000,Gestion_Stock!$B$8:$B$1000,Commande_CIDAG!$B10,Gestion_Stock!$P$8:$P$1000,Commande_CIDAG!D$9)","v":0},{"$f":"SUMIFS(Gestion_Stock!$O$8:$O$1000,Gestion_Stock!$B$8:$B$1000,Commande_CIDAG!$B10,Gestion_Stock!$P$8:$P$1000,Commande_CIDAG!E$9)","v":0},{"$f":"SUMIFS(Gestion_Stock!$O$8:$O$1000,Gestion_Stock!$B$8:$B$1000,Commande_CIDAG!$B10,Gestion_Stock!$P$8:$P$1000,Commande_CIDAG!F$9)","v":0},{"$f":"SUMIFS(Gestion_Stock!$O$8:$O$1000,Gestion_Stock!$B$8:$B$1000,Commande_CIDAG!$B10,Gestion_Stock!$P$8:$P$1000,Commande_CIDAG!G$9,Gestion_Stock!$Q$8:$Q$1000,Commande_CIDAG!$G$8)","v":0},{"$f":"SUMIFS(Gestion_Stock!$F$8:$F$1000,Gestion_Stock!$H$8:$H$1000,Gestion_Stock!$B$4,Gestion_Stock!$Q$8:$Q$1000,Commande_CIDAG!$O$2,Gestion_Stock!$B$8:$B$1000,$B10)","v":0},{"$f":"SUMIFS(Gestion_Stock!$F$8:$F$1000,Gestion_Stock!$Q$8:$Q$1000,Commande_CIDAG!$O$2,Gestion_Stock!$B$8:$B$1000,$B10)-SUMIFS(Gestion_Stock!$F$8:$F$1000,Gestion_Stock!$H$8:$H$1000,Gestion_Stock!$B$4,Gestion_Stock!$Q$8:$Q$1000,Commande_CIDAG!$O$2,Gestion_Stock!$B$8:$B$1000,$B10)","v":0},{"$f":"ROUND(H10*4/3,0)","v":0},{"$f":"ROUND(I10*4/3,0)","v":0},{"$f":"IF(J10+K10-C10 >0,J10+K10-C10,0)","v":0}]
[null,"Ceftriaxone",{"$f":"SUM(D11:F11)","v":0},{"$f":"SUMIFS(Gestion_Stock!$O$8:$O$1000,Gestion_Stock!$B$8:$B$1000,Commande_CIDAG!$B11,Gestion_Stock!$P$8:$P$1000,Commande_CIDAG!D$9)","v":0},{"$f":"SUMIFS(Gestion_Stock!$O$8:$O$1000,Gestion_Stock!$B$8:$B$1000,Commande_CIDAG!$B11,Gestion_Stock!$P$8:$P$1000,Commande_CIDAG!E$9)","v":0},{"$f":"SUMIFS(Gestion_Stock!$O$8:$O$1000,Gestion_Stock!$B$8:$B$1000,Commande_CIDAG!$B11,Gestion_Stock!$P$8:$P$1000,Commande_CIDAG!F$9)","v":0},{"$f":"SUMIFS(Gestion_Stock!$O$8:$O$1000,Gestion_Stock!$B$8:$B$1000,Commande_CIDAG!$B11,Gestion_Stock!$P$8:$P$1000,Commande_CIDAG!G$9,Gestion_Stock!$Q$8:$Q$1000,Commande_CIDAG!$G$8)","v":0},{"$f":"SUMIFS(Gestion_Stock!$F$8:$F$1000,Gestion_Stock!$H$8:$H$1000,Gestion_Stock!$B$4,Gestion_Stock!$Q$8:$Q$1000,Commande_CIDAG!$O$2,Gestion_Stock!$B$8:$B$1000,$B11)","v":0},{"$f":"SUMIFS(Gestion_Stock!$F$8:$F$1000,Gestion_Stock!$Q$8:$Q$1000,Commande_CIDAG!$O$2,Gestion_Stock!$B$8:$B$1000,$B11)-SUMIFS(Gestion_Stock!$F$8:$F$1000,Gestion_Stock!$H$8:$H$1000,Gestion_Stock!$B$4,Gestion_Stock!$Q$8:$Q$1000,Commande_CIDAG!$O$2,Gestion_Stock!$B$8:$B$1000,$B11)","v":0},{"$f":"ROUND(H11*4/3,0)","v":0},{"$f":"ROUND(I11*4/3,0)","v":0},{"$f":"IF(J11+K11-C11 >0,J11+K11-C11,0)","v":0}]
[null,"Erythromycine",0,{"$f":"SUMIFS(Gestion_Stock!$O$8:$O$1000,Gestion_Stock!$B$8:$B$1000,Commande_CIDAG!$B12,Gestion_Stock!$P$8:$P$1000,Commande_CIDAG!D$9)","v":0},{"$f":"SUMIFS(Gestion_Stock!$O$8:$O$1000,Gestion_Stock!$B$8:$B$1000,Commande_CIDAG!$B12,Gestion_Stock!$P$8:$P$1000,Commande_CIDAG!E$9)","v":0},{"$f":"SUMIFS(Gestion_Stock!$O$8:$O$1000,Gestion_Stock!$B$8:$B$1000,Commande_CIDAG!$B12,Gestion_Stock!$P$8:$P$1000,Commande_CIDAG!F$9)","v":0},{"$f":"SUMIFS(Gestion_Stock!$O$8:$O$1000,Gestion_Stock!$B$8:$B$1000,Commande_CIDAG!$B12,Gestion_Stock!$P$8:$P$1000,Commande_CIDAG!G$9,Gestion_Stock!$Q$8:$Q$1000,Commande_CIDAG!$G$8)","v":0},{"$f":"SUMIFS(Gestion_Stock!$F$8:$F$1000,Gestion_Stock!$H$8:$H$1000,Gestion_Stock!$B$4,Gestion_Stock!$Q$8:$Q$1000,Commande_CIDAG!$O$2,Gestion_Stock!$B$8:$B$1000,$B12)","v":0},{"$f":"SUMIFS(Gestion_Stock!$F$8:$F$1000,Gestion_Stock!$Q$8:$Q$1000,Commande_CIDAG!$O$2,Gestion_Stock!$B$8:$B$1000,$B12)-SUMIFS(Gestion_Stock!$F$8:$F$1000,Gestion_Stock!$H$8:$H$1000,Gestion_Stock!$B$4,Gestion_Stock!$Q$8:$Q$1000,Commande_CIDAG!$O$2,Gestion_Stock!$B$8:$B$1000,$B12)","v":0},0,0,0]
[null,"Doxicycline",0,{"$f":"SUMIFS(Gestion_Stock!$O$8:$O$1000,Gestion_Stock!$B$8:$B$1000,Commande_CIDAG!$B13,Gestion_Stock!$P$8:$P$1000,Commande_CIDAG!D$9)","v":0},{"$f":"SUMIFS(Gestion_Stock!$O$8:$O$1000,Gestion_Stock!$B$8:$B$1000,Commande_CIDAG!$B13,Gestion_Stock!$P$8:$P$1000,Commande_CIDAG!E$9)","v":0},{"$f":"SUMIFS(Gestion_Stock!$O$8:$O$1000,Gestion_Stock!$B$8:$B$1000,Commande_CIDAG!$B13,Gestion_Stock!$P$8:$P$1000,Commande_CIDAG!F$9)","v":0},{"$f":"SUMIFS(Gestion_Stock!$O$8:$O$1000,Gestion_Stock!$B$8:$B$1000,Commande_CIDAG!$B13,Gestion_Stock!$P$8:$P$1000,Commande_CIDAG!G$9,Gestion_Stock!$Q$8:$Q$1000,Commande_CIDAG!$G$8)","v":0},{"$f":"SUMIFS(Gestion_Stock!$F$8:$F$1000,Gestion_Stock!$H$8:$H$1000,Gestion_Stock!$B$4,Gestion_Stock!$Q$8:$Q$1000,Commande_CIDAG!$O$2,Gestion_Stock!$B$8:$B$1000,$B13)","v":0},{"$f":"SUMIFS(Gestion_Stock!$F$8:$F$1000,Gestion_Stock!$Q$8:$Q$1000,Commande_CIDAG!$O$2,Gestion_Stock!$B$8:$B$1000,$B13)-SUMIFS(Gestion_Stock!$F$8:$F$1000,Gestion_Stock!$H$8:$H$1000,Gestion_Stock!$B$4,Gestion_Stock!$Q$8:$Q$1000,Commande_CIDAG!$O$2,Gestion_Stock!$B$8:$B$1000,$B13)","v":0},0,0,0]
[null,"Econazol",0,{"$f":"SUMIFS(Gestion_Stock!$O$8:$O$1000,Gestion_Stock!$B$8:$B$1000,Commande_CIDAG!$B14,Gestion_Stock!$P$8:$P$1000,Commande_CIDAG!D$9)","v":0},{"$f":"SUMIFS(Gestion_Stock!$O$8:$O$1000,Gestion_Stock!$B$8:$B$1000,Commande_CIDAG!$B14,Gestion_Stock!$P$8:$P$1000,Commande_CIDAG!E$9)","v":0},{"$f":"SUMIFS(Gestion_Stock!$O$8:$O$1000,Gestion_Stock!$B$8:$B$1000,Commande_CIDAG!$B14,Gestion_Stock!$P$8:$P$1000,Commande_CIDAG!F$9)","v":0},{"$f":"SUMIFS(Gestion_Stock!$O$8:$O$1000,Gestion_Stock!$B$8:$B$1000,Commande_CIDAG!$B14,Gestion_Stock!$P$8:$P$1000,Commande_CIDAG!G$9,Gestion_Stock!$Q$8:$Q$1000,Commande_CIDAG!$G$8)","v":0},{"$f":"SUMIFS(Gestion_Stock!$F$8:$F$1000,Gestion_Stock!$H$8:$H$1000,Gestion_Stock!$B$4,Gestion_Stock!$Q$8:$Q$1000,Commande_CIDAG!$O$2,Gestion_Stock!$B$8:$B$1000,$B14)","v":0},{"$f":"SUMIFS(Gestion_Stock!$F$8:$F$1000,Gestion_Stock!$Q$8:$Q$1000,Commande_CIDAG!$O$2,Gestion_Stock!$B$8:$B$1000,$B14)-SUMIFS(Gestion_Stock!$F$8:$F$1000,Gestion_Stock!$H$8:$H$1000,Gestion_Stock!$B$4,Gestion_Stock!$Q$8:$Q$1000,Commande_CIDAG!$O$2,Gestion_Stock!$B$8:$B$1000,$B14)","v":0},0,0,0]
[null,"Métronidazol",0,{"$f":"SUMIFS(Gestion_Stock!$O$8:$O$1000,Gestion_Stock!$B$8:$B$1000,Commande_CIDAG!$B15,Gestion_Stock!$P$8:$P$1000,Commande_CIDAG!D$9)","v":0},{"$f":"SUMIFS(Gestion_Stock!$O$8:$O$1000,Gestion_Stock!$B$8:$B$1000,Commande_CIDAG!$B15,Gestion_Stock!$P$8:$P$1000,Commande_CIDAG!E$9)","v":0},{"$f":"SUMIFS(Gestion_Stock!$O$8:$O$1000,Gestion_Stock!$B$8:$B$1000,Commande_CIDAG!$B15,Gestion_Stock!$P$8:$P$1000,Commande_CIDAG!F$9)","v":0},{"$f":"SUMIFS(Gestion_Stock!$O$8:$O$1000,Gestion_Stock!$B$8:$B$1000,Commande_CIDAG!$B15,Gestion_Stock!$P$8:$P$1000,Commande_CIDAG!G$9,Gestion_Stock!$Q$8:$Q$1000,Commande_CIDAG!$G$8)","v":0},{"$f":"SUMIFS(Gestion_Stock!$F$8:$F$1000,Gestion_Stock!$H$8:$H$1000,Gestion_Stock!$B$4,Gestion_Stock!$Q$8:$Q$1000,Commande_CIDAG!$O$2,Gestion_Stock!$B$8:$B$1000,$B15)","v":0},{"$f":"SUMIFS(Gestion_Stock!$F$8:$F$1000,Gestion_Stock!$Q$8:$Q$1000,Commande_CIDAG!$O$2,Gestion_Stock!$B$8:$B$1000,$B15)-SUMIFS(Gestion_Stock!$F$8:$F$1000,Gestion_Stock!$H$8:$H$1000,Gestion_Stock!$B$4,Gestion_Stock!$Q$8:$Q$1000,Commande_CIDAG!$O$2,Gestion_Stock!$B$8:$B$1000,$B15)","v":0},0,0,0]
[null,"Ciprofloxacine",0,{"$f":"SUMIFS(Gestion_Stock!$O$8:$O$1000,Gestion_Stock!$B$8:$B$1000,Commande_CIDAG!$B16,Gestion_Stock!$P$8:$P$1000,Commande_CIDAG!D$9)","v":0},{"$f":"SUMIFS(Gestion_Stock!$O$8:$O$1000,Gestion_Stock!$B$8:$B$1000,Commande_CIDAG!$B16,Gestion_Stock!$P$8:$P$1000,Commande_CIDAG!E$9)","v":0},{"$f":"SUMIFS(Gestion_Stock!$O$8:$O$1000,Gestion_Stock!$B$8:$B$1000,Commande_CIDAG!$B16,Gestion_Stock!$P$8:$P$1000,Commande_CIDAG!F$9)","v":0},{"$f":"SUMIFS(Gestion_Stock!$O$8:$O$1000,Gestion_Stock!$B$8:$B$1000,Commande_CIDAG!$B16,Gestion_Stock!$P$8:$P$1000,Commande_CIDAG!G$9,Gestion_Stock!$Q$8:$Q$1000,Commande_CIDAG!$G$8)","v":0},{"$f":"SUMIFS(Gestion_Stock!$F$8:$F$1000,Gestion_Stock!$H$8:$H$1000,Gestion_Stock!$B$4,Gestion_Stock!$Q$8:$Q$1000,Commande_CIDAG!$O$2,Gestion_Stock!$B$8:$B$1000,$B16)","v":0},{"$f":"SUMIFS(Gestion_Stock!$F$8:$F$1000,Gestion_Stock!$Q$8:$Q$1000,Commande_CIDAG!$O$2,Gestion_Stock!$B$8:$B$1000,$B16)-SUMIFS(Gestion_Stock!$F$8:$F$1000,Gestion_Stock!$H$8:$H$1000,Gestion_Stock!$B$4,Gestion_Stock!$Q$8:$Q$1000,Commande_CIDAG!$O$2,Gestion_Stock!$B$8:$B$1000,$B16)","v":0},0,0,0]
[]
[]
[null,null,null,null,null,null,null,"Signé par : "]
[]
[]
[null,null,null,null,null,null,null,"Qualité :"]