{"text_format":"1","workbook":"xlsx","n_sheets":13,"sheets":["Accueil","Registre_IST","Modification","Nouveau","Modif2","Valid","Rap_Mens","Rap_Sem","Rap_Trim","Méd_cons","Gestion_Stock","Etat_stock","Commande_CIDAG"],"not_rendered":{"charts":0,"images":2,"macros":1,"external_links":0,"defined_names":65,"comments":3,"pivot_tables":0},"unopened":[],"bounds":{"document_bytes":16777216,"sheet_cells":100000,"rows_first":2000,"rows_last":500,"rows_between":2000,"halvings":0,"cell_chars":16384,"cell_head_chars":4096},"cells_cut":0,"cells_raw":0,"read":"whole","date_system":"1900"}

{"sheet":"Accueil","index":0,"n_rows":14,"n_cols":13,"rows_kept":14,"cut":false,"hidden":false,"merged":[[2,8,2,13],[8,3,8,4],[9,3,9,4],[13,5,13,7],[13,8,13,10],[13,11,13,13],[10,3,10,4],[3,8,3,10],[3,12,3,13],[4,8,4,10],[4,12,4,13],[5,8,5,10],[5,12,5,13],[6,8,6,10],[6,12,6,13],[7,8,7,10],[7,12,7,13],[8,8,8,10],[8,12,8,13],[9,8,9,10],[9,12,9,13]]}
[null,"Association de Lutte Contre le Sida"]
[null,"Consultation IST"]
[null,null,null,null,null,null,null,null,"Alertes stock"]
[null,null,null,null,null,null,null,null,{"$f":"IF(Etat_stock!F10>0,\"Extencilline proche peremption :\",\"\")","v":""},null,null,{"$f":"IF(Etat_stock!F10>0,Etat_stock!F10,\"\")","v":""},{"$f":"IF(Etat_stock!H10=\"Stock insuffisant\",\"Stock Extencilline insuffisant\",\"\")","v":"Stock Extencilline insuffisant"}]
[null,null,null,null,null,null,null,null,{"$f":"IF(Etat_stock!F11>0,\"Péni A proche peremption :\",\"\")","v":""},null,null,{"$f":"IF(Etat_stock!F11>0,Etat_stock!F11,\"\")","v":""},{"$f":"IF(Etat_stock!H11=\"Stock insuffisant\",\"Stock Ceftriaxone insuffisant\",\"\")","v":"Stock Ceftriaxone insuffisant"}]
[null,null,null,null,null,null,null,null,{"$f":"IF(Etat_stock!F12>0,\"Erythromycine proche peremption :\",\"\")","v":""},null,null,{"$f":"IF(Etat_stock!F12>0,Etat_stock!F12,\"\")","v":""},{"$f":"IF(Etat_stock!H12=\"Stock insuffisant\",\"Stock Erythromycine insuffisant\",\"\")","v":"Stock Erythromycine insuffisant"}]
[null,null,null,null,null,null,null,null,{"$f":"IF(Etat_stock!F13>0,\"Doxicycline proche peremption :\",\"\")","v":""},null,null,{"$f":"IF(Etat_stock!F13>0,Etat_stock!F13,\"\")","v":""},{"$f":"IF(Etat_stock!H13=\"Stock insuffisant\",\"Stock Doxicycline insuffisant\",\"\")","v":"Stock Doxicycline insuffisant"}]
[null,null,null,null,null,null,null,null,{"$f":"IF(Etat_stock!F14>0,\"Econazol proche peremption :\",\"\")","v":""},null,null,{"$f":"IF(Etat_stock!F14>0,Etat_stock!F14,\"\")","v":""},{"$f":"IF(Etat_stock!H14=\"Stock insuffisant\",\"Stock Econazole insuffisant\",\"\")","v":"Stock Econazole insuffisant"}]
[null,"Section",null,null,null,null,null,null,{"$f":"IF(Etat_stock!F15>0,\"Métronidazol proche peremption :\",\"\")","v":""},null,null,{"$f":"IF(Etat_stock!F15>0,Etat_stock!F15,\"\")","v":""},{"$f":"IF(Etat_stock!H15=\"Stock insuffisant\",\"Stock Métronidazol insuffisant\",\"\")","v":"Stock Métronidazol insuffisant"}]
[null,"Année",null,null,null,null,null,null,{"$f":"IF(Etat_stock!F16>0,\"Ciprofloxacine proche peremption :\",\"\")","v":""},null,null,{"$f":"IF(Etat_stock!F16>0,Etat_stock!F16,\"\")","v":""},{"$f":"IF(Etat_stock!H16=\"Stock insuffisant\",\"Stock Ciprofloxacine insuffisant\",\"\")","v":"Stock Ciprofloxacine insuffisant"}]
{"$rows_left_out":5}
{"sheet":"Registre_IST","index":1,"n_rows":10088,"n_cols":27,"rows_kept":10088,"cut":false,"hidden":true,"merged":[]}
["Date","Date2","Mois","Num ordre","Num consultant","Age","Gr.  Age","Gr.  Age1","Sexe","Sexe1","Sit. Matr","Bénéficiaires","Bénéficiaires1","Cas","Synd. IST","Synd. IST1 ","Prise ATB","Bilans prescrits","Résultats","Traitements","Quantité ","Observations","Section","Stratégie","Site","Trimestre","Semestre"]
[]
[]
[]
[]
[]
[]
[]
[]
[]
{"$rows_left_out":10079}
{"sheet":"Modification","index":2,"n_rows":22,"n_cols":27,"rows_kept":22,"cut":false,"hidden":true,"merged":[[1,0,3,0],[1,4,3,4],[1,5,3,5],[1,6,3,6],[1,8,3,8],[1,21,3,21],[21,13,24,14],[11,1,11,2],[11,5,11,6],[12,10,14,10],[17,10,19,10],[20,9,20,10],[21,11,24,12],[1,11,3,11],[1,13,3,13],[1,14,3,14],[1,16,3,16],[10,11,10,12],[10,13,10,14],[9,5,9,7],[1,10,3,10]]}
["Date","Date1","Mois","Num ordre","Num consultant","Age","Gr.  Age","Gr.  Age1","Sexe","Sexe1","Sit. Matr","Bénéficiaires","Bénéficiaires1","Cas","Synd. IST","Synd. IST1 ","Prise ATB","Bilans prescrits","Résultats","Traitements","Quantité ","Observations","Section","Stratégie","Site","Trimestre","Semestre"]
[{"$f":"IF(C10<>\"\",C10,\"\")","v":""},{"$f":"IF(A2<>\"\",A2,\"\")","v":""},{"$f":"IF(B2<>\"\",INDEX([0]!Mois_date,MONTH(B2),1),\"\")","v":""},{"$f":"IF(Num_ligne=0,\"\",INDEX(Bd_num,Num_ligne,1))","v":""},{"$f":"IF($D$2<>\"\",Accueil!$D$11&+\"-\"&+$D$2&+\"-\"&+ MID(Accueil!$D$10,1,4),\"\")","v":""},{"$f":"IF(E13<>\"\",E13,C13)","v":""},{"$f":"IF(F2=\"\",\"\",IF(F2>49,\"50et+\",IF(F2>39,\"40-49\",IF(F2>29,\"30-39\",IF(F2>19,\"20-29\",IF(F2>14,\"15-19\",\"\"))))))","v":""},{"$f":"G2","v":""},{"$f":"C15&\"\"","v":""},{"$f":"I2","v":""},{"$f":"IF(E19<>\"\",E19,C19)","v":""},{"$f":"IF(E17<>\"\",E17,C17)","v":""},{"$f":"IF(L2<>\"\",L2,\"\")","v":""},{"$f":"IF(H13<>\"\",H13,G13)","v":""},{"$f":"IF(H15<>\"\",H15,G15)","v":""},{"$f":"IF(O2<>\"\",O2,\"\")","v":""},{"$f":"IF(H17<>\"\",H17,G17)","v":""},{"$f":"IF(N13<>\"\",N13,L13)","v":""},"",{"$f":"IF(N18<>\"\",N18,L18)","v":""},"",{"$f":"IF(N22<>\"\",N22,\"\")","v":""},{"$f":"IF(Accueil!$D$9<>\"\",Accueil!$D$9,\"\")","v":""},{"$f":"IF($E$8<>\"\",$E$8,Strategie)","v":""},{"$f":"IF($H$8<>\"\",$H$8,$G$8)","v":""},{"$f":"IF(OR(C2=\"Janvier\",C2=\"Février\",C2=\"Mars\"),\"Trimestre 1\",IF(OR(C2=\"Avril\",C2=\"Mai\",C2=\"Juin\"),\"Trimestre 2\",IF(OR(C2=\"Juillet\",C2=\"Août\",C2=\"Septembre\"),\"Trimestre 3\",IF(OR(C2=\"Octobre\",C2=\"Novembre\",C2=\"Décembre\"),\"Trimestre 4\",\"\"))))","v":""},{"$f":"IF(OR(Z2=\"Trimestre 1\",Z2=\"Trimestre 2\"),\"Semestre 1\",IF(OR(Z2=\"Trimestre 3\",Z2=\"Trimestre 4\"),\"Semestre 2\",\"\"))","v":""}]
[null,{"$f":"IF(A2<>\"\",A2,\"\")","v":""},{"$f":"IF(B3<>\"\",INDEX([0]!Mois_date,MONTH(B3),1),\"\")","v":""},{"$f":"IF(Num_ligne=0,\"\",INDEX(Bd_num,Num_ligne,1))","v":""},null,null,null,{"$f":"H2","v":""},null,{"$f":"J2","v":""},null,null,{"$f":"IF(L2<>\"\",L2,\"\")","v":""},null,null,{"$f":"IF(O2<>\"\",O2,\"\")","v":""},null,"","","","",null,{"$f":"IF(Accueil!$D$9<>\"\",Accueil!$D$9,\"\")","v":""},{"$f":"IF($E$8<>\"\",$E$8,Strategie)","v":""},{"$f":"IF($H$8<>\"\",$H$8,$G$8)","v":""},{"$f":"IF(OR(C3=\"Janvier\",C3=\"Février\",C3=\"Mars\"),\"Trimestre 1\",IF(OR(C3=\"Avril\",C3=\"Mai\",C3=\"Juin\"),\"Trimestre 2\",IF(OR(C3=\"Juillet\",C3=\"Août\",C3=\"Septembre\"),\"Trimestre 3\",IF(OR(C3=\"Octobre\",C3=\"Novembre\",C3=\"Décembre\"),\"Trimestre 4\",\"\"))))","v":""},{"$f":"IF(OR(Z3=\"Trimestre 1\",Z3=\"Trimestre 2\"),\"Semestre 1\",IF(OR(Z3=\"Trimestre 3\",Z3=\"Trimestre 4\"),\"Semestre 2\",\"\"))","v":""}]
[null,{"$f":"IF(A2<>\"\",A2,\"\")","v":""},{"$f":"IF(B4<>\"\",INDEX([0]!Mois_date,MONTH(B4),1),\"\")","v":""},{"$f":"IF(Num_ligne=0,\"\",INDEX(Bd_num,Num_ligne,1))","v":""},null,null,null,{"$f":"H3","v":""},null,{"$f":"J2","v":""},null,null,{"$f":"IF(L2<>\"\",L2,\"\")","v":""},null,null,{"$f":"IF(O2<>\"\",O2,\"\")","v":""},null,"","","","",null,{"$f":"IF(Accueil!$D$9<>\"\",Accueil!$D$9,\"\")","v":""},{"$f":"IF($E$8<>\"\",$E$8,Strategie)","v":""},{"$f":"IF($H$8<>\"\",$H$8,$G$8)","v":""},{"$f":"IF(OR(C4=\"Janvier\",C4=\"Février\",C4=\"Mars\"),\"Trimestre 1\",IF(OR(C4=\"Avril\",C4=\"Mai\",C4=\"Juin\"),\"Trimestre 2\",IF(OR(C4=\"Juillet\",C4=\"Août\",C4=\"Septembre\"),\"Trimestre 3\",IF(OR(C4=\"Octobre\",C4=\"Novembre\",C4=\"Décembre\"),\"Trimestre 4\",\"\"))))","v":""},{"$f":"IF(OR(Z4=\"Trimestre 1\",Z4=\"Trimestre 2\"),\"Semestre 1\",IF(OR(Z4=\"Trimestre 3\",Z4=\"Trimestre 4\"),\"Semestre 2\",\"\"))","v":""}]
[]
[null,"Modification - suppression des enregistrements"]
[]
[null,"Stratégie",{"$f":"IF(Num_ligne=0,\"\",INDEX(Bd_strat,Num_ligne,1))","v":""},null,null,"Site",{"$f":"IF(Num_ligne=0,\"\",INDEX(Bd_site,Num_ligne,1))","v":""}]
[]
[null,"Date",{"$f":"IF(Num_ligne=0,\"\",INDEX(Bd_date,Num_ligne,1))","v":""},null,null,"Numéro d'ordre"]
{"$rows_left_out":13}
{"sheet":"Nouveau","index":3,"n_rows":21,"n_cols":27,"rows_kept":21,"cut":false,"hidden":true,"merged":[[1,0,3,0],[1,5,3,5],[1,6,3,6],[1,8,3,8],[1,10,3,10],[20,9,20,10],[1,4,3,4],[9,6,9,7],[21,11,24,12],[10,11,10,12],[1,11,3,11],[12,10,14,10],[17,10,19,10],[11,1,11,2],[11,5,11,6],[1,21,3,21],[1,13,3,13],[1,14,3,14],[1,16,3,16]]}
["Date","Date1","Mois","Num ordre","Num consultant","Age","Gr.  Age","Gr.  Age1","Sexe","Sexe1","Sit. Matr","Bénéficiaires","Bénéficiaires1","Cas","Synd. IST","Synd. IST1 ","Prise ATB","Bilans prescrits","Résultats","Traitements","Quantité ","Observations","Section","Stratégie","Site","Trimestre","Semestre"]
[{"$f":"IF(C10<>\"\",C10,\"\")","v":"2009-02-02"},{"$f":"IF(A2<>\"\",A2,\"\")","v":"2009-02-02"},{"$f":"IF(B2<>\"\",INDEX([0]!Mois_date,MONTH(B2),1),\"\")","v":"Février"},{"$f":"MAX(Registre_IST!$D:$D)+1","v":1},{"$f":"Accueil!$D$11&+\"-\"&+$D$2&+\"-\"&+ MID(Accueil!$D$10,1,4)","v":"-1-"},{"$f":"IF(C13<>\"\",C13,\"\")","v":""},{"$f":"IF(F2=\"\",\"\",IF(F2>49,\"50et+\",IF(F2>39,\"40-49\",IF(F2>29,\"30-39\",IF(F2>19,\"20-29\",IF(F2>14,\"15-19\",\"\"))))))","v":""},{"$f":"G2","v":""},{"$f":"C15&\"\"","v":""},{"$f":"I2","v":""},{"$f":"C19&\"\"","v":""},{"$f":"C17&\"\"","v":""},{"$f":"IF(L2<>\"\",L2,\"\")","v":""},{"$f":"G13&\"\"","v":""},{"$f":"G15&\"\"","v":""},{"$f":"IF(O2<>\"\",O2,\"\")","v":""},{"$f":"G17&\"\"","v":""},{"$f":"L13&\"\"","v":""},"",{"$f":"L18&\"\"","v":""},{"$f":"IF(M18<>\"\",M18,\"\")","v":""},{"$f":"L22&\"\"","v":""},{"$f":"IF(Accueil!$D$9<>\"\",Accueil!$D$9,\"\")","v":""},{"$f":"$C$8&\"\"","v":"Mobile"},{"$f":"$G$8&\"\"","v":""},{"$f":"IF(OR(C2=\"Janvier\",C2=\"Février\",C2=\"Mars\"),\"Trimestre 1\",IF(OR(C2=\"Avril\",C2=\"Mai\",C2=\"Juin\"),\"Trimestre 2\",IF(OR(C2=\"Juillet\",C2=\"Août\",C2=\"Septembre\"),\"Trimestre 3\",IF(OR(C2=\"Octobre\",C2=\"Novembre\",C2=\"Décembre\"),\"Trimestre 4\",\"\"))))","v":"Trimestre 1"},{"$f":"IF(OR(Z2=\"Trimestre 1\",Z2=\"Trimestre 2\"),\"Semestre 1\",IF(OR(Z2=\"Trimestre 3\",Z2=\"Trimestre 4\"),\"Semestre 2\",\"\"))","v":"Semestre 1"}]
[null,{"$f":"IF(A2<>\"\",A2,\"\")","v":"2009-02-02"},{"$f":"IF(B3<>\"\",INDEX([0]!Mois_date,MONTH(B3),1),\"\")","v":"Février"},{"$f":"MAX(Registre_IST!$D:$D)+1","v":1},null,null,null,{"$f":"H2","v":""},null,{"$f":"J2","v":""},null,null,{"$f":"IF(L2<>\"\",L2,\"\")","v":""},null,null,{"$f":"IF(O2<>\"\",O2,\"\")","v":""},null,"","",{"$f":"L19&\"\"","v":""},{"$f":"IF(M19<>\"\",M19,\"\")","v":""},null,{"$f":"IF(Accueil!$D$9<>\"\",Accueil!$D$9,\"\")","v":""},{"$f":"$C$8&\"\"","v":"Mobile"},{"$f":"$G$8&\"\"","v":""},{"$f":"IF(OR(C3=\"Janvier\",C3=\"Février\",C3=\"Mars\"),\"Trimestre 1\",IF(OR(C3=\"Avril\",C3=\"Mai\",C3=\"Juin\"),\"Trimestre 2\",IF(OR(C3=\"Juillet\",C3=\"Août\",C3=\"Septembre\"),\"Trimestre 3\",IF(OR(C3=\"Octobre\",C3=\"Novembre\",C3=\"Décembre\"),\"Trimestre 4\",\"\"))))","v":"Trimestre 1"},{"$f":"IF(OR(Z3=\"Trimestre 1\",Z3=\"Trimestre 2\"),\"Semestre 1\",IF(OR(Z3=\"Trimestre 3\",Z3=\"Trimestre 4\"),\"Semestre 2\",\"\"))","v":"Semestre 1"}]
[null,{"$f":"IF(A2<>\"\",A2,\"\")","v":"2009-02-02"},{"$f":"IF(B4<>\"\",INDEX([0]!Mois_date,MONTH(B4),1),\"\")","v":"Février"},{"$f":"MAX(Registre_IST!$D:$D)+1","v":1},null,null,null,{"$f":"H3","v":""},null,{"$f":"J2","v":""},null,null,{"$f":"IF(L2<>\"\",L2,\"\")","v":""},null,null,{"$f":"IF(O2<>\"\",O2,\"\")","v":""},null,"","",{"$f":"L20&\"\"","v":""},{"$f":"IF(M20<>\"\",M20,\"\")","v":""},null,{"$f":"IF(Accueil!$D$9<>\"\",Accueil!$D$9,\"\")","v":""},{"$f":"$C$8&\"\"","v":"Mobile"},{"$f":"$G$8&\"\"","v":""},{"$f":"IF(OR(C4=\"Janvier\",C4=\"Février\",C4=\"Mars\"),\"Trimestre 1\",IF(OR(C4=\"Avril\",C4=\"Mai\",C4=\"Juin\"),\"Trimestre 2\",IF(OR(C4=\"Juillet\",C4=\"Août\",C4=\"Septembre\"),\"Trimestre 3\",IF(OR(C4=\"Octobre\",C4=\"Novembre\",C4=\"Décembre\"),\"Trimestre 4\",\"\"))))","v":"Trimestre 1"},{"$f":"IF(OR(Z4=\"Trimestre 1\",Z4=\"Trimestre 2\"),\"Semestre 1\",IF(OR(Z4=\"Trimestre 3\",Z4=\"Trimestre 4\"),\"Semestre 2\",\"\"))","v":"Semestre 1"}]
[]
[null,"Enregistrement d'un nouveau consultant pour IST"]
[]
[null,"Stratégie","Mobile",null,null,"Site"]
[]
[null,"Date","2009-02-02",null,null,"Numéro d'ordre",{"$f":"$E$2&\"\"","v":"-1-"}]
{"$rows_left_out":12}
{"sheet":"Modif2","index":4,"n_rows":4,"n_cols":27,"rows_kept":4,"cut":false,"hidden":true,"merged":[[1,10,3,10],[1,0,3,0],[1,4,3,4],[1,5,3,5],[1,6,3,6],[1,8,3,8],[1,11,3,11],[1,13,3,13],[1,14,3,14],[1,16,3,16],[1,21,3,21]]}
[]
["2009-02-02","2009-02-02","Février",1,"AGADIR-1-2009",22,"20-29","20-29","M","M","Marié","UDI","UDI","NC","Ecoul. Urétral","Ecoul. Urétral","Oui","","","","","","Agadir","Fixe","Ayada","Trimestre 1","Semestre 1"]
[null,"2009-02-02","Février",1,null,null,null,"20-29",null,"M",null,null,"UDI",null,null,"Ecoul. Urétral",null,"","","","",null,"Agadir","Fixe","Ayada","Trimestre 1","Semestre 1"]
[null,"2009-02-02","Février",1,null,null,null,"20-29",null,"M",null,null,"UDI",null,null,"Ecoul. Urétral",null,"","","","",null,"Agadir","Fixe","Ayada","Trimestre 1","Semestre 1"]

{"sheet":"Valid","index":5,"n_rows":97,"n_cols":13,"rows_kept":97,"cut":false,"hidden":true,"merged":[]}
[null,null,null,null,null,null,null,null,null,null,"Num ligne",null,0]
[null,null,null,null,null,null,null,null,null,null,"Nb_enregistrements",null,{"$f":"COUNTA(Registre_IST!$C:$C)-1","v":0}]
["Ecoul. Urétral",null,null,null,null,null,null,null,null,null,"Nb_lignes",null,{"$f":"Nb_enregistrements+1","v":1}]
["Vaginite"]
["Cervicite",null,null,null,null,null,null,"Semestre 1","Trimestre 1"]
["Douleurs bas ventre",null,null,null,"Fixe",null,null,"Semestre 2","Trimestre 2"]
["Ulcère génital",null,null,null,"Mobile",null,null,null,"Trimestre 3"]
["Autres",null,null,null,null,null,null,null,"Trimestre 4"]
[]
[]
{"$rows_left_out":88}
{"sheet":"Rap_Mens","index":6,"n_rows":27,"n_cols":11,"rows_kept":27,"cut":false,"hidden":true,"merged":[[10,7,10,8],[10,9,10,10],[1,2,1,3],[2,2,2,3],[3,2,3,3],[10,1,10,2],[10,3,10,4],[10,5,10,6]]}
["Association de Lutte Contre le Sida"]
["Section",null,{"$f":"IF(Accueil!$D$9<>\"\",Accueil!$D$9,\"\")","v":""}]
["Année",null,{"$f":"IF(Accueil!$D$10<>\"\",Accueil!$D$10,\"\")","v":""}]
["CIDAG",null,{"$f":"IF(Accueil!$D$11<>\"\",Accueil!$D$11,\"\")","v":""}]
[]
["Consultation IST"]
[]
["Mois","Février",null,null,null,"Stratégie","Mobile"]
["Bénéficiaires","UDI"]
[]
{"$rows_left_out":18}
{"sheet":"Rap_Sem","index":7,"n_rows":27,"n_cols":11,"rows_kept":27,"cut":false,"hidden":true,"merged":[[10,7,10,8],[10,9,10,10],[1,2,1,3],[2,2,2,3],[3,2,3,3],[10,1,10,2],[10,3,10,4],[10,5,10,6]]}
["Association de Lutte Contre le Sida"]
["Section",null,{"$f":"IF(Accueil!$D$9<>\"\",Accueil!$D$9,\"\")","v":""}]
["Année",null,{"$f":"IF(Accueil!$D$10<>\"\",Accueil!$D$10,\"\")","v":""}]
["CIDAG",null,{"$f":"IF(Accueil!$D$11<>\"\",Accueil!$D$11,\"\")","v":""}]
[]
["Consultation IST"]
[]
["Période","Semestre 1",null,null,null,"Stratégie","Fixe"]
["Bénéficiaires","Tous"]
[]
{"$rows_left_out":18}
{"sheet":"Rap_Trim","index":8,"n_rows":27,"n_cols":11,"rows_kept":27,"cut":false,"hidden":true,"merged":[[10,5,10,6],[10,7,10,8],[10,9,10,10],[1,2,1,3],[2,2,2,3],[3,2,3,3],[10,1,10,2],[10,3,10,4]]}
["Association de Lutte Contre le Sida"]
["Section",null,{"$f":"IF(Accueil!$D$9<>\"\",Accueil!$D$9,\"\")","v":""}]
["Année",null,{"$f":"IF(Accueil!$D$10<>\"\",Accueil!$D$10,\"\")","v":""}]
["CIDAG",null,{"$f":"IF(Accueil!$D$11<>\"\",Accueil!$D$11,\"\")","v":""}]
[]
["Consultation IST"]
[]
["Période","Trimestre 1",null,null,null,"Stratégie"]
["Bénéficiaires","PS"]
[]
{"$rows_left_out":18}
{"sheet":"Méd_cons","index":9,"n_rows":21,"n_cols":18,"rows_kept":21,"cut":false,"hidden":true,"merged":[[1,2,1,3],[2,2,2,3],[3,2,3,3]]}
["Association de Lutte Contre le Sida"]
["Section",null,{"$f":"IF(Accueil!$D$9<>\"\",Accueil!$D$9,\"\")","v":""}]
["Année",null,{"$f":"IF(Accueil!$D$10<>\"\",Accueil!$D$10,\"\")","v":""}]
["CIDAG",null,{"$f":"IF(Accueil!$D$11<>\"\",Accueil!$D$11,\"\")","v":""}]
[]
["Consultation IST"]
[]
[]
["Consommation en médicaments"]
[]
{"$rows_left_out":12}
{"sheet":"Gestion_Stock","index":10,"n_rows":1500,"n_cols":18,"rows_kept":1500,"cut":false,"hidden":true,"merged":[]}
[]
["Association de Lutte Contre le Sida"]
["Section",{"$f":"IF(Accueil!$D$9<>\"\",Accueil!$D$9,\"\")","v":""}]
["CIDAG",{"$f":"IF(Accueil!$D$11<>\"\",Accueil!$D$11,\"\")","v":""},null,"Gestion des médicaments IST"]
["Année",{"$f":"IF(Accueil!$D$10<>\"\",Accueil!$D$10,\"\")","v":""}]
[]
["Date","Désignation","Num_Lot","Date_per","Entrées","Sorties","Approvisionné par","Destination_Sortie","Observation",null,null,null,null,"Mois","Stock","Test","Trimestre","Semestre"]
[null,null,null,null,null,null,null,null,{"$f":"IF(AND(A8<>\"\",YEAR(A8)<>$B$5),\"Erreur date\",\"\")","v":""},null,null,null,null,{"$f":"IF(A8<>\"\",INDEX(Mois_date,MONTH(A8),1),\"\")","v":""},{"$f":"IF(OR(E8<>\"\",F8<>\"\"),E8-F8,\"\")","v":""},{"$f":"IF(AND(D8<>\"\",D8<=TODAY()),\"Perimé\",IF(AND(D8<>\"\",D8<=TODAY()+30),\"Moins d'un mois\",IF(AND(D8<>\"\",D8<=TODAY()+90),\"Moins 3 mois\",IF(AND(D8<>\"\",D8>TODAY()+90),\"Plus 3 mois\",\"\"))))","v":""},{"$f":"IF(OR(N8=\"Janvier\",N8=\"Février\",N8=\"Mars\"),\"Trimestre 1\",IF(OR(N8=\"Avril\",N8=\"Mai\",N8=\"Juin\"),\"Trimestre 2\",IF(OR(N8=\"Juillet\",N8=\"Août\",N8=\"Septembre\"),\"Trimestre 3\",IF(OR(N8=\"Octobre\",N8=\"Novembre\",N8=\"Décembre\"),\"Trimestre 4\",\"\"))))","v":""},{"$f":"IF(OR(Q8=\"Trimestre 1\",Q8=\"Trimestre 2\"),\"Semestre 1\",IF(OR(Q8=\"Trimestre 3\",Q8=\"Trimestre 4\"),\"Semestre 2\",\"\"))","v":""}]
[null,null,null,null,null,null,null,null,{"$f":"IF(AND(A9<>\"\",YEAR(A9)<>$B$5),\"Erreur date\",\"\")","v":""},null,null,null,null,"",{"$f":"IF(OR(E9<>\"\",F9<>\"\"),E9-F9,\"\")","v":""},{"$f":"IF(AND(D9<>\"\",D9<=TODAY()),\"Perimé\",IF(AND(D9<>\"\",D9<=TODAY()+30),\"Moins d'un mois\",IF(AND(D9<>\"\",D9<=TODAY()+90),\"Moins 3 mois\",IF(AND(D9<>\"\",D9>TODAY()+90),\"Plus 3 mois\",\"\"))))","v":""},{"$f":"IF(OR(N9=\"Janvier\",N9=\"Février\",N9=\"Mars\"),\"Trimestre 1\",IF(OR(N9=\"Avril\",N9=\"Mai\",N9=\"Juin\"),\"Trimestre 2\",IF(OR(N9=\"Juillet\",N9=\"Août\",N9=\"Septembre\"),\"Trimestre 3\",IF(OR(N9=\"Octobre\",N9=\"Novembre\",N9=\"Décembre\"),\"Trimestre 4\",\"\"))))","v":""},{"$f":"IF(OR(Q9=\"Trimestre 1\",Q9=\"Trimestre 2\"),\"Semestre 1\",IF(OR(Q9=\"Trimestre 3\",Q9=\"Trimestre 4\"),\"Semestre 2\",\"\"))","v":""}]
[null,null,null,null,null,null,null,null,"",null,null,null,null,"","","","",""]
{"$rows_left_out":1491}
{"sheet":"Etat_stock","index":11,"n_rows":16,"n_cols":8,"rows_kept":16,"cut":false,"hidden":true,"merged":[[7,1,8,1],[7,2,8,2],[7,3,7,6],[7,7,8,7]]}
["Association de Lutte Contre le Sida"]
[]
["Section",{"$f":"IF(Accueil!$D$9<>\"\",Accueil!$D$9,\"\")","v":""},null,"Etat du stock médicaments IST"]
["CIDAG",{"$f":"IF(Accueil!$D$11<>\"\",Accueil!$D$11,\"\")","v":""}]
["Année",{"$f":"IF(Accueil!$D$10<>\"\",Accueil!$D$10,\"\")","v":""},null,"Date",{"$f":"TODAY()","v":"2011-12-20"}]
[]
[]
[null,"Désignation","Stock disponible","Peremptions",null,null,null,"Etat stock"]
[null,null,null,"Plus 3 mois","Moins 3 mois","Moins d'un mois","Perimé"]
[null,"Benz Péni 1,2",{"$f":"SUM(D10:F10)","v":0},{"$f":"SUMIFS(Gestion_Stock!$O$8:$O$1000,Gestion_Stock!$B$8:$B$1000,Etat_stock!$B10,Gestion_Stock!$P$8:$P$1000,Etat_stock!D$9)","v":0},{"$f":"SUMIFS(Gestion_Stock!$O$8:$O$1000,Gestion_Stock!$B$8:$B$1000,Etat_stock!$B10,Gestion_Stock!$P$8:$P$1000,Etat_stock!E$9)","v":0},{"$f":"SUMIFS(Gestion_Stock!$O$8:$O$1000,Gestion_Stock!$B$8:$B$1000,Etat_stock!$B10,Gestion_Stock!$P$8:$P$1000,Etat_stock!F$9)","v":0},{"$f":"SUMIFS(Gestion_Stock!$O$8:$O$1000,Gestion_Stock!$B$8:$B$1000,Etat_stock!$B10,Gestion_Stock!$P$8:$P$1000,Etat_stock!G$9)","v":0},{"$f":"IF(C10<=25,\"Stock insuffisant\",\"\")","v":"Stock insuffisant"}]
{"$rows_left_out":7}
{"sheet":"Commande_CIDAG","index":12,"n_rows":22,"n_cols":15,"rows_kept":22,"cut":false,"hidden":true,"merged":[[7,9,7,10],[6,6,6,8],[7,1,8,1],[7,2,8,2],[7,3,7,5],[7,6,7,8]]}
["Association de Lutte Contre le Sida"]
[null,null,null,null,null,null,null,null,null,null,null,null,null,null,{"$f":"\"Trimestre\"&+\" \"&+ G3-1","v":"Trimestre 4"}]
["Section",{"$f":"IF(Accueil!$B$9<>\"\",Accueil!$B$9,\"\")","v":"Section"},"Commande médicaments IST trimestre :",null,null,null,5]
["CIDAG",{"$f":"IF(Accueil!$B$11<>\"\",Accueil!$B$11,\"\")","v":"CIDAG"}]
["Année",{"$f":"IF(Accueil!$B$10<>\"\",Accueil!$B$10,\"\")","v":"Année"},null,"Date",{"$f":"TODAY()","v":"2011-12-20"}]
[]
[]
[null,"Désignation","Stock disponible","Délais de peremption des quantites en stock",null,null,{"$f":"O2&\"\"","v":"Trimestre 4"},null,null,"Besoins pour    :",null,{"$f":"\"Trimestre\"&+\" \"&+G3","v":"Trimestre 5"}]
[null,null,null,"Plus 3 mois","Moins 3 mois","Moins d'un mois","Perimé","Utilisé par CIDAG","Utilisé par autre","Besoins CIDAG","Besoins autre","Total"]
[null,"Benz Péni 1,2",{"$f":"SUM(D10:F10)","v":0},{"$f":"SUMIFS(Gestion_Stock!$O$8:$O$1000,Gestion_Stock!$B$8:$B$1000,Commande_CIDAG!$B10,Gestion_Stock!$P$8:$P$1000,Commande_CIDAG!D$9)","v":0},{"$f":"SUMIFS(Gestion_Stock!$O$8:$O$1000,Gestion_Stock!$B$8:$B$1000,Commande_CIDAG!$B10,Gestion_Stock!$P$8:$P$1000,Commande_CIDAG!E$9)","v":0},{"$f":"SUMIFS(Gestion_Stock!$O$8:$O$1000,Gestion_Stock!$B$8:$B$1000,Commande_CIDAG!$B10,Gestion_Stock!$P$8:$P$1000,Commande_CIDAG!F$9)","v":0},{"$f":"SUMIFS(Gestion_Stock!$O$8:$O$1000,Gestion_Stock!$B$8:$B$1000,Commande_CIDAG!$B10,Gestion_Stock!$P$8:$P$1000,Commande_CIDAG!G$9,Gestion_Stock!$Q$8:$Q$1000,Commande_CIDAG!$G$8)","v":0},{"$f":"SUMIFS(Gestion_Stock!$F$8:$F$1000,Gestion_Stock!$H$8:$H$1000,Gestion_Stock!$B$4,Gestion_Stock!$Q$8:$Q$1000,Commande_CIDAG!$O$2,Gestion_Stock!$B$8:$B$1000,$B10)","v":0},{"$f":"SUMIFS(Gestion_Stock!$F$8:$F$1000,Gestion_Stock!$Q$8:$Q$1000,Commande_CIDAG!$O$2,Gestion_Stock!$B$8:$B$1000,$B10)-SUMIFS(Gestion_Stock!$F$8:$F$1000,Gestion_Stock!$H$8:$H$1000,Gestion_Stock!$B$4,Gestion_Stock!$Q$8:$Q$1000,Commande_CIDAG!$O$2,Gestion_Stock!$B$8:$B$1000,$B10)","v":0},{"$f":"ROUND(H10*4/3,0)","v":0},{"$f":"ROUND(I10*4/3,0)","v":0},{"$f":"IF(J10+K10-C10 >0,J10+K10-C10,0)","v":0}]
{"$rows_left_out":12}